Shard Windows tests 4 ways. (#2698) #3460
128 passed, 717 failed and 80 skipped
Report | Passed | Failed | Skipped | Time |
---|---|---|---|---|
dist/test-results/integration-1.xml | 30✅ | 175❌ | 16⚪ | 1235s |
dist/test-results/integration-2.xml | 32✅ | 172❌ | 21⚪ | 1030s |
dist/test-results/integration-3.xml | 26✅ | 185❌ | 14⚪ | 1195s |
dist/test-results/integration-4.xml | 40✅ | 183❌ | 29⚪ | 1500s |
dist/test-results/unit.xml | 2❌ | 78s |
❌ dist/test-results/integration-1.xml
221 tests were completed in 1235s with 30 passed, 175 failed and 16 skipped.
Test suite | Passed | Failed | Skipped | Time |
---|---|---|---|---|
pytest | 30✅ | 175❌ | 16⚪ | 1235s |
❌ pytest
❌ tests.integration.test_issue_2073
pex\pip\installation.py:262: in bootstrap_pip
⚪ tests.integration.test_sh_boot
⚪ tests.integration.test_shebang_length_limit
tests.integration.test_issue_1817
⚪ test_sdist_for_project_with_pep517_build
tests.integration.test_issue_157
❌ test_empty_pex_no_args[NO_COLOR-scie-ZIPAPP]
tmpdir = Tempdir(path='C:\\Users\\runneradmin\\AppData\\Local\\Temp\\pytest-of-runneradmin\\pytest-0\\popen-gw1\\test_empty_pex...admin\\AppData\\Local\\Temp\\pytest-of-runneradmin\\pytest-0\\popen-gw1\\test_empty_pex_no_args_NO_COLOR_scie_ZIPAPP_')
❌ test_empty_pex_no_args[NO_COLOR-scie-VENV]
tmpdir = Tempdir(path='C:\\Users\\runneradmin\\AppData\\Local\\Temp\\pytest-of-runneradmin\\pytest-0\\popen-gw1\\test_empty_pex...eradmin\\AppData\\Local\\Temp\\pytest-of-runneradmin\\pytest-0\\popen-gw1\\test_empty_pex_no_args_NO_COLOR_scie_VENV_')
❌ test_pex_cli_no_args[VENV]
tmpdir = Tempdir(path='C:\\Users\\runneradmin\\AppData\\Local\\Temp\\pytest-of-runneradmin\\pytest-0\\popen-gw0\\test_pex_cli_no_args_VENV_0', symlink=None)
❌ test_empty_pex_no_args[FORCE_COLOR-scie-VENV]
tmpdir = Tempdir(path='C:\\Users\\runneradmin\\AppData\\Local\\Temp\\pytest-of-runneradmin\\pytest-0\\popen-gw0\\test_empty_pex...dmin\\AppData\\Local\\Temp\\pytest-of-runneradmin\\pytest-0\\popen-gw0\\test_empty_pex_no_args_FORCE_COLOR_scie_VENV_')
❌ test_pex_info_command_packed_pex_directory
tmpdir = Tempdir(path='C:\\Users\\runneradmin\\AppData\\Local\\Temp\\pytest-of-runneradmin\\pytest-0\\popen-gw0\\test_pex_info_...eradmin\\AppData\\Local\\Temp\\pytest-of-runneradmin\\pytest-0\\popen-gw0\\test_pex_info_command_packed_pex_directory')
❌ test_empty_pex_no_args[IS_TTY-traditional-ZIPAPP]
tmpdir = Tempdir(path='C:\\Users\\runneradmin\\AppData\\Local\\Temp\\pytest-of-runneradmin\\pytest-0\\popen-gw0\\test_empty_pex...\\AppData\\Local\\Temp\\pytest-of-runneradmin\\pytest-0\\popen-gw0\\test_empty_pex_no_args_IS_TTY_traditional_ZIPAPP_')
❌ test_empty_pex_no_args[NO_COLOR-traditional-ZIPAPP]
tmpdir = Tempdir(path='C:\\Users\\runneradmin\\AppData\\Local\\Temp\\pytest-of-runneradmin\\pytest-0\\popen-gw0\\test_empty_pex...AppData\\Local\\Temp\\pytest-of-runneradmin\\pytest-0\\popen-gw0\\test_empty_pex_no_args_NO_COLOR_traditional_ZIPAPP_')
❌ test_empty_pex_no_args[TERM=dumb-traditional-VENV]
tmpdir = Tempdir(path='C:\\Users\\runneradmin\\AppData\\Local\\Temp\\pytest-of-runneradmin\\pytest-0\\popen-gw1\\test_empty_pex...\AppData\\Local\\Temp\\pytest-of-runneradmin\\pytest-0\\popen-gw1\\test_empty_pex_no_args_TERM_dumb_traditional_VENV_')
❌ test_empty_pex_no_args[FORCE_COLOR-traditional-VENV]
tmpdir = Tempdir(path='C:\\Users\\runneradmin\\AppData\\Local\\Temp\\pytest-of-runneradmin\\pytest-0\\popen-gw0\\test_empty_pex...ppData\\Local\\Temp\\pytest-of-runneradmin\\pytest-0\\popen-gw0\\test_empty_pex_no_args_FORCE_COLOR_traditional_VENV_')
tests.integration.test_issue_1598
❌ test_mount_respects_env
pex_project_dir = 'D:/a/pex/pex/repo'
tests.integration.test_issue_1933
⚪ test_musllinux_wheels_resolved
tests.integration.cli.commands.test_lock_foreign_platform_sdist
❌ test_lock_foreign_platform_sdist
tmpdir = Tempdir(path='C:\\Users\\runneradmin\\AppData\\Local\\Temp\\pytest-of-runneradmin\\pytest-0\\popen-gw0\\test_lock_fore...sers\\runneradmin\\AppData\\Local\\Temp\\pytest-of-runneradmin\\pytest-0\\popen-gw0\\test_lock_foreign_platform_sdist')
tests.integration.test_inject_python_args
❌ test_python_args_passthrough[PYTHON-ZIPAPP]
tmpdir = Tempdir(path='C:\\Users\\runneradmin\\AppData\\Local\\Temp\\pytest-of-runneradmin\\pytest-0\\popen-gw1\\test_python_ar...radmin\\AppData\\Local\\Temp\\pytest-of-runneradmin\\pytest-0\\popen-gw1\\test_python_args_passthrough_PYTHON_ZIPAPP_')
❌ test_python_args_passthrough[SH_BOOT-VENV]
tmpdir = Tempdir(path='C:\\Users\\runneradmin\\AppData\\Local\\Temp\\pytest-of-runneradmin\\pytest-0\\popen-gw0\\test_python_ar...eradmin\\AppData\\Local\\Temp\\pytest-of-runneradmin\\pytest-0\\popen-gw0\\test_python_args_passthrough_SH_BOOT_VENV_')
tests.integration.test_issue_1995
⚪ test_packaging
tests.integration.test_pex_import
❌ test_import_from_pex[UNZIPPED-zipapp]
tmpdir = Tempdir(path='C:\\Users\\runneradmin\\AppData\\Local\\Temp\\pytest-of-runneradmin\\pytest-0\\popen-gw0\\test_import_fr...\runneradmin\\AppData\\Local\\Temp\\pytest-of-runneradmin\\pytest-0\\popen-gw0\\test_import_from_pex_UNZIPPED_zipapp_')
❌ test_import_from_pex[VENV-packed]
tmpdir = Tempdir(path='C:\\Users\\runneradmin\\AppData\\Local\\Temp\\pytest-of-runneradmin\\pytest-0\\popen-gw0\\test_import_fr...ers\\runneradmin\\AppData\\Local\\Temp\\pytest-of-runneradmin\\pytest-0\\popen-gw0\\test_import_from_pex_VENV_packed_')
❌ test_import_from_pex[UNZIPPED-loose]
tmpdir = Tempdir(path='C:\\Users\\runneradmin\\AppData\\Local\\Temp\\pytest-of-runneradmin\\pytest-0\\popen-gw0\\test_import_fr...\\runneradmin\\AppData\\Local\\Temp\\pytest-of-runneradmin\\pytest-0\\popen-gw0\\test_import_from_pex_UNZIPPED_loose_')
tests.integration.cli.commands.test_issue_1734
❌ test_lock_create_sdist_requires_python_different_from_current
@pytest.fixture
tests.integration.test_issue_1025
❌ test_extras_isolation
create_pth = <function create_pth.<locals>.write_pth at 0x000001FB53D40C20>
tests.integration.venv_ITs.test_install_wheel_multiple_site_packages_dirs
⚪ test_installed_wheels
tests.integration.venv_ITs.test_issue_1637
❌ test_pex_path_dedup
tmpdir = Tempdir(path='C:\\Users\\runneradmin\\AppData\\Local\\Temp\\pytest-of-runneradmin\\pytest-0\\popen-gw1\\test_pex_path_dedup0', symlink=None)
❌ test_pex_path_collision_non_conflicting[zipapp]
tmpdir = Tempdir(path='C:\\Users\\runneradmin\\AppData\\Local\\Temp\\pytest-of-runneradmin\\pytest-0\\popen-gw0\\test_pex_path_...in\\AppData\\Local\\Temp\\pytest-of-runneradmin\\pytest-0\\popen-gw0\\test_pex_path_collision_non_conflicting_zipapp_')
tests.integration.resolve.test_issue_1918
⚪ test_redacted_requirement_handling[24.3-pip-2020-resolver-direct-reference]
⚪ test_redacted_requirement_handling[24.2-pip-2020-resolver-direct-reference]
⚪ test_redacted_requirement_handling[24.1.2-pip-2020-resolver-direct-reference]
⚪ test_redacted_requirement_handling[24.1.2-pip-2020-resolver-pip-proprietary]
⚪ test_redacted_requirement_handling[25.0.1-pip-2020-resolver-direct-reference]
tests.integration.build_system.test_pep_517
❌ test_build_sdist_pyproject_toml
tmpdir = Tempdir(path='C:\\Users\\runneradmin\\AppData\\Local\\Temp\\pytest-of-runneradmin\\pytest-0\\popen-gw1\\test_build_sdi...Users\\runneradmin\\AppData\\Local\\Temp\\pytest-of-runneradmin\\pytest-0\\popen-gw1\\test_build_sdist_pyproject_toml')
tests.integration.test_issue_1560
❌ test_build_isolation[3.9.13]
venv_factory = VenvFactory(python_version='3.9.13', _factory=<function all_python_venvs.<locals>.<genexpr>.<lambda> at 0x000001FB53E2B600>)
tests.integration.cli.commands.test_issue_2057
❌ test_lock_create_local_project_direct_reference[Subset [PEP-508]-Create Lock [Pip Proprietary]]
tmpdir = Tempdir(path='C:\\Users\\runneradmin\\AppData\\Local\\Temp\\pytest-of-runneradmin\\pytest-0\\popen-gw0\\test_lock_crea...\pytest-0\\popen-gw0\\test_lock_create_local_project_direct_reference_Subset__PEP_508__Create_Lock__Pip_Proprietary__')
❌ test_lock_create_archive_direct_reference[Full-Create Lock [Pip Proprietary]]
tmpdir = Tempdir(path='C:\\Users\\runneradmin\\AppData\\Local\\Temp\\pytest-of-runneradmin\\pytest-0\\popen-gw0\\test_lock_crea...st-of-runneradmin\\pytest-0\\popen-gw0\\test_lock_create_archive_direct_reference_Full_Create_Lock__Pip_Proprietary__')
tests.integration.cli.commands.test_vcs_lock
❌ test_subdir
test_tool = TestTool(tmpdir='C:\\Users\\runneradmin\\AppData\\Local\\Temp\\pytest-of-runneradmin\\pytest-0\\popen-gw1\\test_subdir0')
tests.integration.cli.commands.test_lock_sync
❌ test_sync_venv_noop
shared_integration_test_tmpdir = 'C:\\Users\\runneradmin\\AppData\\Local\\Temp\\pytest-of-runneradmin\\pytest-0\\shared_integration_test_tmpdir'
❌ test_sync_extras
tmpdir = Tempdir(path='C:\\Users\\runneradmin\\AppData\\Local\\Temp\\pytest-of-runneradmin\\pytest-0\\popen-gw1\\test_sync_extras0', symlink=None)
❌ test_sync_venv_run_retain_user_pip[--retain-pip]
shared_integration_test_tmpdir = 'C:\\Users\\runneradmin\\AppData\\Local\\Temp\\pytest-of-runneradmin\\pytest-0\\shared_integration_test_tmpdir'
❌ test_sync_venv_run_retain_user_pip[--no-retain-pip]
shared_integration_test_tmpdir = 'C:\\Users\\runneradmin\\AppData\\Local\\Temp\\pytest-of-runneradmin\\pytest-0\\shared_integration_test_tmpdir'
❌ test_sync_venv_add
shared_integration_test_tmpdir = 'C:\\Users\\runneradmin\\AppData\\Local\\Temp\\pytest-of-runneradmin\\pytest-0\\shared_integration_test_tmpdir'
❌ test_sync_venv_complex
shared_integration_test_tmpdir = 'C:\\Users\\runneradmin\\AppData\\Local\\Temp\\pytest-of-runneradmin\\pytest-0\\shared_integration_test_tmpdir'
❌ test_sync_implicit_lock_create_venv_create_run
shared_integration_test_tmpdir = 'C:\\Users\\runneradmin\\AppData\\Local\\Temp\\pytest-of-runneradmin\\pytest-0\\shared_integration_test_tmpdir'
tests.integration.cli.commands.test_issue_2050
⚪ test_pep_517_prepare_metadata_for_build_wheel_fallback
tests.integration.tools.commands.test_issue_2105
✅ test_pip_pex_setuptools_conflict
tests.integration.resolve.test_issue_1907
❌ test_pre_resolved_dists_nominal
shared_integration_test_tmpdir = 'C:\\Users\\runneradmin\\AppData\\Local\\Temp\\pytest-of-runneradmin\\pytest-0\\shared_integration_test_tmpdir'
❌ test_pre_resolved_dists_local_project_requirement
shared_integration_test_tmpdir = 'C:\\Users\\runneradmin\\AppData\\Local\\Temp\\pytest-of-runneradmin\\pytest-0\\shared_integration_test_tmpdir'
❌ test_pre_resolved_dists_project_requirement
shared_integration_test_tmpdir = 'C:\\Users\\runneradmin\\AppData\\Local\\Temp\\pytest-of-runneradmin\\pytest-0\\shared_integration_test_tmpdir'
tests.integration.test_excludes
❌ test_exclude_deep[24.1.1-resolvelib]
tmpdir = Tempdir(path='C:\\Users\\runneradmin\\AppData\\Local\\Temp\\pytest-of-runneradmin\\pytest-0\\popen-gw0\\test_exclude_d...\\runneradmin\\AppData\\Local\\Temp\\pytest-of-runneradmin\\pytest-0\\popen-gw0\\test_exclude_deep_24_1_1_resolvelib_')
❌ test_exclude_deep[24.2-resolvelib]
tmpdir = Tempdir(path='C:\\Users\\runneradmin\\AppData\\Local\\Temp\\pytest-of-runneradmin\\pytest-0\\popen-gw0\\test_exclude_d...rs\\runneradmin\\AppData\\Local\\Temp\\pytest-of-runneradmin\\pytest-0\\popen-gw0\\test_exclude_deep_24_2_resolvelib_')
tests.integration.venv_ITs.test_issue_2160
❌ test_ns_package_split_across_sources_and_deps[packed-zipapp]
def bootstrap_pip():
❌ test_ns_package_split_across_sources_and_deps[zipapp-zipapp]
def bootstrap_pip():
❌ test_ns_package_split_across_sources_and_deps[loose-venv (site-packages symlinks)]
def bootstrap_pip():
❌ test_ns_package_split_across_sources_and_deps[zipapp-venv (site-packages symlinks)]
def bootstrap_pip():
tests.integration.test_integration
❌ test_pex_multi_resolve_1
tmpdir = Tempdir(path='C:\\Users\\runneradmin\\AppData\\Local\\Temp\\pytest-of-runneradmin\\pytest-0\\popen-gw1\\test_pex_multi_resolve_12', symlink=None)
❌ test_pex_path_in_pex_info_and_env
def test_pex_path_in_pex_info_and_env():
❌ test_pex_repl_built
def test_pex_repl_built():
❌ test_seed_verbose[Python-.whl file-loose-PEX]
isort_pex_args = ('C:\\Users\\runneradmin\\AppData\\Local\\Temp\\pytest-of-runneradmin\\pytest-0\\popen-gw1\\test_seed_verbose_Python-a...n<'3.6'", "setuptools==44.1.1; python_version<'3.6'", "isort==5.6.4; python_version>='3.6'", '-c', 'isort', '-o', ...])
❌ test_seed_verbose[Python-installed wheel chroot-loose-PEX]
isort_pex_args = ('C:\\Users\\runneradmin\\AppData\\Local\\Temp\\pytest-of-runneradmin\\pytest-0\\popen-gw1\\test_seed_verbose_Python-f...n<'3.6'", "setuptools==44.1.1; python_version<'3.6'", "isort==5.6.4; python_version>='3.6'", '-c', 'isort', '-o', ...])
❌ test_cache_disable
def test_cache_disable():
❌ test_seed_verbose[Python-.whl file-zipapp-PEX]
isort_pex_args = ('C:\\Users\\runneradmin\\AppData\\Local\\Temp\\pytest-of-runneradmin\\pytest-0\\popen-gw0\\test_seed_verbose_Python-9...n<'3.6'", "setuptools==44.1.1; python_version<'3.6'", "isort==5.6.4; python_version>='3.6'", '-c', 'isort', '-o', ...])
❌ test_seed_verbose[Python-.whl file-zipapp-VENV]
isort_pex_args = ('C:\\Users\\runneradmin\\AppData\\Local\\Temp\\pytest-of-runneradmin\\pytest-0\\popen-gw0\\test_seed_verbose_Python-f...n<'3.6'", "setuptools==44.1.1; python_version<'3.6'", "isort==5.6.4; python_version>='3.6'", '-c', 'isort', '-o', ...])
❌ test_emit_warnings_default
def test_emit_warnings_default():
❌ test_seed_verbose[Direct-.whl file-loose-VENV]
isort_pex_args = ('C:\\Users\\runneradmin\\AppData\\Local\\Temp\\pytest-of-runneradmin\\pytest-0\\popen-gw0\\test_seed_verbose_Direct-2...n<'3.6'", "setuptools==44.1.1; python_version<'3.6'", "isort==5.6.4; python_version>='3.6'", '-c', 'isort', '-o', ...])
❌ test_seed_verbose[Python-installed wheel chroot-loose-VENV]
isort_pex_args = ('C:\\Users\\runneradmin\\AppData\\Local\\Temp\\pytest-of-runneradmin\\pytest-0\\popen-gw0\\test_seed_verbose_Python-8...n<'3.6'", "setuptools==44.1.1; python_version<'3.6'", "isort==5.6.4; python_version>='3.6'", '-c', 'isort', '-o', ...])
✅ test_pex_run_strip_env
❌ test_no_emit_warnings_2
def test_no_emit_warnings_2():
❌ test_binary_scripts[installed wheel chroot-zipapp-VENV]
tmpdir = Tempdir(path='C:\\Users\\runneradmin\\AppData\\Local\\Temp\\pytest-of-runneradmin\\pytest-0\\popen-gw1\\test_binary_sc...ata\\Local\\Temp\\pytest-of-runneradmin\\pytest-0\\popen-gw1\\test_binary_scripts_installed_wheel_chroot_zipapp_VENV_')
❌ test_binary_scripts[.whl file-loose-PEX]
tmpdir = Tempdir(path='C:\\Users\\runneradmin\\AppData\\Local\\Temp\\pytest-of-runneradmin\\pytest-0\\popen-gw0\\test_binary_sc...nneradmin\\AppData\\Local\\Temp\\pytest-of-runneradmin\\pytest-0\\popen-gw0\\test_binary_scripts__whl_file_loose_PEX_')
❌ test_seed[.whl file-loose-PEX]
isort_pex_args = ('C:\\Users\\runneradmin\\AppData\\Local\\Temp\\pytest-of-runneradmin\\pytest-0\\popen-gw1\\test_seed__whl_file_loose_...n<'3.6'", "setuptools==44.1.1; python_version<'3.6'", "isort==5.6.4; python_version>='3.6'", '-c', 'isort', '-o', ...])
❌ test_seed[installed wheel chroot-loose-PEX]
isort_pex_args = ('C:\\Users\\runneradmin\\AppData\\Local\\Temp\\pytest-of-runneradmin\\pytest-0\\popen-gw0\\test_seed_installed_whee-4...n<'3.6'", "setuptools==44.1.1; python_version<'3.6'", "isort==5.6.4; python_version>='3.6'", '-c', 'isort', '-o', ...])
❌ test_binary_scripts[installed wheel chroot-loose-PEX]
tmpdir = Tempdir(path='C:\\Users\\runneradmin\\AppData\\Local\\Temp\\pytest-of-runneradmin\\pytest-0\\popen-gw1\\test_binary_sc...pData\\Local\\Temp\\pytest-of-runneradmin\\pytest-0\\popen-gw1\\test_binary_scripts_installed_wheel_chroot_loose_PEX_')
✅ test_invalid_entry_point_verification_3rdparty[installed wheel chroot-packed]
✅ test_invalid_entry_point_verification_3rdparty[installed wheel chroot-zipapp]
✅ test_invalid_entry_point_verification_3rdparty[.whl file-loose]
❌ test_binary_scripts[.whl file-zipapp-VENV]
tmpdir = Tempdir(path='C:\\Users\\runneradmin\\AppData\\Local\\Temp\\pytest-of-runneradmin\\pytest-0\\popen-gw0\\test_binary_sc...eradmin\\AppData\\Local\\Temp\\pytest-of-runneradmin\\pytest-0\\popen-gw0\\test_binary_scripts__whl_file_zipapp_VENV_')
❌ test_requirements_network_configuration
self = <pex.venv.virtualenv.Virtualenv object at 0x000001FB54026DE0>
❌ test_seed[installed wheel chroot-loose-VENV]
isort_pex_args = ('C:\\Users\\runneradmin\\AppData\\Local\\Temp\\pytest-of-runneradmin\\pytest-0\\popen-gw1\\test_seed_installed_whee-c...n<'3.6'", "setuptools==44.1.1; python_version<'3.6'", "isort==5.6.4; python_version>='3.6'", '-c', 'isort', '-o', ...])
✅ test_pex_source_bundling_pep420
✅ test_pex_execute
✅ test_tmpdir_file
tests.integration.cli.commands.test_issue_1711
❌ test_backtrack_links_preserved
tmpdir = Tempdir(path='C:\\Users\\runneradmin\\AppData\\Local\\Temp\\pytest-of-runneradmin\\pytest-0\\popen-gw0\\test_backtrack_links_preserved0', symlink=None)
tests.integration.test_issue_2415
⚪ test_gevent_monkeypatch
tests.integration.test_keyring_support
❌ test_subprocess_provider[False-24.1]
def bootstrap_pip():
❌ test_import_provider[True-25.0.1]
def bootstrap_pip():
❌ test_import_provider[True-24.1]
def bootstrap_pip():
❌ test_import_provider[False-25.0.1]
def bootstrap_pip():
❌ test_import_provider[False-24.1]
def bootstrap_pip():
❌ test_subprocess_provider[True-25.0.1]
def bootstrap_pip():
❌ test_subprocess_provider[True-24.1]
def bootstrap_pip():
❌ test_subprocess_provider[False-25.0.1]
def bootstrap_pip():
tests.integration.test_issue_2017
⚪ test_statically_linked_musl_libc_cpython_support[25.0.1]
tests.integration.cli.commands.test_lock_subset
❌ test_lock_subset_subset
input_requirements = ('D:/a/pex/pex/repo[management]', 'ansicolors', 'requests')
❌ test_lock_subset_extra
input_requirements = ('D:/a/pex/pex/repo[management]', 'ansicolors', 'requests')
tests.integration.cli.commands.test_lock_script_metadata
❌ test_lock_create_script_simple
tmpdir = Tempdir(path='C:\\Users\\runneradmin\\AppData\\Local\\Temp\\pytest-of-runneradmin\\pytest-0\\popen-gw0\\test_lock_create_script_simple0', symlink=None)
tests.integration.test_pex_bootstrapper
❌ test_boot_compatible_issue_1020_no_ic
tmpdir = Tempdir(path='C:\\Users\\runneradmin\\AppData\\Local\\Temp\\pytest-of-runneradmin\\pytest-0\\popen-gw1\\test_boot_comp...\runneradmin\\AppData\\Local\\Temp\\pytest-of-runneradmin\\pytest-0\\popen-gw1\\test_boot_compatible_issue_1020_no_ic')
❌ test_ensure_venv_namespace_packages
tmpdir = Tempdir(path='C:\\Users\\runneradmin\\AppData\\Local\\Temp\\pytest-of-runneradmin\\pytest-0\\popen-gw0\\test_ensure_ve...s\\runneradmin\\AppData\\Local\\Temp\\pytest-of-runneradmin\\pytest-0\\popen-gw0\\test_ensure_venv_namespace_packages')
❌ test_ensure_venv_short_link
pex_project_dir = 'D:/a/pex/pex/repo'
❌ test_boot_compatible_issue_1020_ic_min_compatible_build_time_hole
tmpdir = Tempdir(path='C:\\Users\\runneradmin\\AppData\\Local\\Temp\\pytest-of-runneradmin\\pytest-0\\popen-gw1\\test_boot_comp...\\Temp\\pytest-of-runneradmin\\pytest-0\\popen-gw1\\test_boot_compatible_issue_1020_ic_min_compatible_build_time_hole')
❌ test_boot_resolve_fail
tmpdir = Tempdir(path='C:\\Users\\runneradmin\\AppData\\Local\\Temp\\pytest-of-runneradmin\\pytest-0\\popen-gw1\\test_boot_resolve_fail0', symlink=None)
tests.integration.cli.commands.test_issue_2519
❌ test_sync_version_mismatch_prefer_binary_all_pips[25.0.1]
pip_version = '25.0.1'
❌ test_sync_version_mismatch_prefer_binary_all_pips[24.1]
pip_version = '24.1'
❌ test_sync_version_mismatch_new_pip[24.1.1]
pip_version = '24.1.1'
tests.integration.test_issue_2249
❌ test_inspect[SCIE-ZIPAPP]
tmpdir = Tempdir(path='C:\\Users\\runneradmin\\AppData\\Local\\Temp\\pytest-of-runneradmin\\pytest-0\\popen-gw1\\test_inspect_SCIE_ZIPAPP_0', symlink=None)
❌ test_inspect[PEX-VENV-SH_BOOT]
tmpdir = Tempdir(path='C:\\Users\\runneradmin\\AppData\\Local\\Temp\\pytest-of-runneradmin\\pytest-0\\popen-gw0\\test_inspect_PEX_VENV_SH_BOOT_0', symlink=None)
tests.integration.test_issue_1949
❌ test_resolve_arbitrary_equality
def bootstrap_pip():
tests.integration.test_issue_2432
❌ test_lock_use_no_build_wheel
tmpdir = Tempdir(path='C:\\Users\\runneradmin\\AppData\\Local\\Temp\\pytest-of-runneradmin\\pytest-0\\popen-gw0\\test_lock_use_no_build_wheel0', symlink=None)
tests.integration.build_system.test_pep_518
❌ test_load_build_system_pyproject_custom_repos
tmpdir = Tempdir(path='C:\\Users\\runneradmin\\AppData\\Local\\Temp\\pytest-of-runneradmin\\pytest-0\\popen-gw1\\test_load_buil...dmin\\AppData\\Local\\Temp\\pytest-of-runneradmin\\pytest-0\\popen-gw1\\test_load_build_system_pyproject_custom_repos')
tests.integration.test_issue_2413
❌ test_venv_with_installs[wheel:yes-setuptools:yes-pip:upgraded]
tmpdir = Tempdir(path='C:\\Users\\runneradmin\\AppData\\Local\\Temp\\pytest-of-runneradmin\\pytest-0\\popen-gw0\\test_venv_with...cal\\Temp\\pytest-of-runneradmin\\pytest-0\\popen-gw0\\test_venv_with_installs_wheel_yes_setuptools_yes_pip_upgraded_')
❌ test_venv_with_installs[wheel:upgraded-setuptools:yes-pip:upgraded]
tmpdir = Tempdir(path='C:\\Users\\runneradmin\\AppData\\Local\\Temp\\pytest-of-runneradmin\\pytest-0\\popen-gw0\\test_venv_with...Temp\\pytest-of-runneradmin\\pytest-0\\popen-gw0\\test_venv_with_installs_wheel_upgraded_setuptools_yes_pip_upgraded_')
✅ test_venv_with_installs[wheel:no-setuptools:no-pip:upgraded]
❌ test_venv_with_installs[wheel:no-setuptools:upgraded-pip:yes]
tmpdir = Tempdir(path='C:\\Users\\runneradmin\\AppData\\Local\\Temp\\pytest-of-runneradmin\\pytest-0\\popen-gw0\\test_venv_with...ocal\\Temp\\pytest-of-runneradmin\\pytest-0\\popen-gw0\\test_venv_with_installs_wheel_no_setuptools_upgraded_pip_yes_')
✅ test_venv_with_installs[wheel:no-setuptools:no-pip:yes]
❌ test_venv_with_installs[wheel:upgraded-setuptools:yes-pip:yes]
tmpdir = Tempdir(path='C:\\Users\\runneradmin\\AppData\\Local\\Temp\\pytest-of-runneradmin\\pytest-0\\popen-gw0\\test_venv_with...cal\\Temp\\pytest-of-runneradmin\\pytest-0\\popen-gw0\\test_venv_with_installs_wheel_upgraded_setuptools_yes_pip_yes_')
❌ test_venv_with_installs[wheel:yes-setuptools:yes-pip:yes]
tmpdir = Tempdir(path='C:\\Users\\runneradmin\\AppData\\Local\\Temp\\pytest-of-runneradmin\\pytest-0\\popen-gw0\\test_venv_with...a\\Local\\Temp\\pytest-of-runneradmin\\pytest-0\\popen-gw0\\test_venv_with_installs_wheel_yes_setuptools_yes_pip_yes_')
tests.integration.cli.commands.test_lock
❌ test_universal_lock[pip-2020-resolver]
tmpdir = Tempdir(path='C:\\Users\\runneradmin\\AppData\\Local\\Temp\\pytest-of-runneradmin\\pytest-0\\popen-gw0\\test_universal...runneradmin\\AppData\\Local\\Temp\\pytest-of-runneradmin\\pytest-0\\popen-gw0\\test_universal_lock_pip_2020_resolver_')
❌ test_update_targeted_add_transitive
def bootstrap_pip():
❌ test_update_targeted_add_dry_run_check
lock_file_path = 'C:\\Users\\runneradmin\\AppData\\Local\\Temp\\pytest-of-runneradmin\\pytest-0\\popen-gw1\\test_update_targeted_add-b72db0\\lock.json'
❌ test_update_targeted_upgrade_dry_run
lock_file_path = 'C:\\Users\\runneradmin\\AppData\\Local\\Temp\\pytest-of-runneradmin\\pytest-0\\popen-gw1\\test_update_targeted_upg-149ec0\\lock.json'
❌ test_update_targeted_add
lock_file_path = 'C:\\Users\\runneradmin\\AppData\\Local\\Temp\\pytest-of-runneradmin\\pytest-0\\popen-gw0\\test_update_targeted_add0\\lock.json'
❌ test_update_noop_dry_run
lock_file_path = 'C:\\Users\\runneradmin\\AppData\\Local\\Temp\\pytest-of-runneradmin\\pytest-0\\popen-gw1\\test_update_noop_dry_run0\\lock.json'
❌ test_update_targeted_mixed_dry_run
lock_file_path = 'C:\\Users\\runneradmin\\AppData\\Local\\Temp\\pytest-of-runneradmin\\pytest-0\\popen-gw0\\test_update_targeted_mix-6c8da0\\lock.json'
tests.integration.venv_ITs.test_issue_1973
❌ test_system_site_packages_venv_pex
tmpdir = Tempdir(path='C:\\Users\\runneradmin\\AppData\\Local\\Temp\\pytest-of-runneradmin\\pytest-0\\popen-gw1\\test_system_si...rs\\runneradmin\\AppData\\Local\\Temp\\pytest-of-runneradmin\\pytest-0\\popen-gw1\\test_system_site_packages_venv_pex')
tests.integration.test_issue_1422
❌ test_unconstrained_universal_venv_pex
tmpdir = Tempdir(path='C:\\Users\\runneradmin\\AppData\\Local\\Temp\\pytest-of-runneradmin\\pytest-0\\popen-gw1\\test_unconstra...\runneradmin\\AppData\\Local\\Temp\\pytest-of-runneradmin\\pytest-0\\popen-gw1\\test_unconstrained_universal_venv_pex')
tests.integration.venv_ITs.test_virtualenv
❌ test_iter_distributions[3.8.10]
venv_factory = VenvFactory(python_version='3.8.10', _factory=<function all_python_venvs.<locals>.<genexpr>.<lambda> at 0x0000023D54A8CE00>)
✅ test_enclosing
tests.integration.cli.commands.test_venv_inspect
❌ test_inspect_venv_non_pex[system_site_packages=True-3.10.7]
python_version = '3.10.7', system_site_packages = True
❌ test_inspect_venv_virtualenv[system_site_packages=False]
tmpdir = Tempdir(path='C:\\Users\\runneradmin\\AppData\\Local\\Temp\\pytest-of-runneradmin\\pytest-0\\popen-gw0\\test_inspect_v...ta\\Local\\Temp\\pytest-of-runneradmin\\pytest-0\\popen-gw0\\test_inspect_venv_virtualenv_system_site_packages_False_')
tests.integration.test_issue_2572
❌ test_symlinked_home
tmpdir = Tempdir(path='C:\\Users\\runneradmin\\AppData\\Local\\Temp\\pytest-of-runneradmin\\pytest-0\\popen-gw1\\test_symlinked_home0', symlink=None)
tests.integration.test_pex_entry_points
❌ test_script
tmpdir = Tempdir(path='C:\\Users\\runneradmin\\AppData\\Local\\Temp\\pytest-of-runneradmin\\pytest-0\\popen-gw1\\test_script0', symlink=None)
✅ test_executable
✅ test_style_mutex
tests.integration.tools.commands.test_venv
❌ test_non_hermetic_issue_2004
pex_project_dir = 'D:/a/pex/pex/repo'
❌ test_collisions
pex_project_dir = 'D:/a/pex/pex/repo'
❌ test_collisions_mergeable_issue_1570
tmpdir = Tempdir(path='C:\\Users\\runneradmin\\AppData\\Local\\Temp\\pytest-of-runneradmin\\pytest-0\\popen-gw0\\test_collision...\\runneradmin\\AppData\\Local\\Temp\\pytest-of-runneradmin\\pytest-0\\popen-gw0\\test_collisions_mergeable_issue_1570')
❌ test_site_packages_copies
tmpdir = Tempdir(path='C:\\Users\\runneradmin\\AppData\\Local\\Temp\\pytest-of-runneradmin\\pytest-0\\popen-gw0\\test_site_packages_copies0', symlink=None)
tests.integration.test_issue_2088
❌ test_venv_symlink_site_packages[--no-venv-site-packages-copies-zipapp]
tmpdir = Tempdir(path='C:\\Users\\runneradmin\\AppData\\Local\\Temp\\pytest-of-runneradmin\\pytest-0\\popen-gw1\\test_venv_syml...p\\pytest-of-runneradmin\\pytest-0\\popen-gw1\\test_venv_symlink_site_packages___no_venv_site_packages_copies_zipapp_')
❌ test_venv_symlink_site_packages[--venv-site-packages-copies-zipapp]
tmpdir = Tempdir(path='C:\\Users\\runneradmin\\AppData\\Local\\Temp\\pytest-of-runneradmin\\pytest-0\\popen-gw0\\test_venv_syml...Temp\\pytest-of-runneradmin\\pytest-0\\popen-gw0\\test_venv_symlink_site_packages___venv_site_packages_copies_zipapp_')
tests.integration.test_issue_2023
❌ test_unpack_robustness[VENV (symlinks)-.whl file-packed]
tmpdir = Tempdir(path='C:\\Users\\runneradmin\\AppData\\Local\\Temp\\pytest-of-runneradmin\\pytest-0\\popen-gw1\\test_unpack_ro...ta\\Local\\Temp\\pytest-of-runneradmin\\pytest-0\\popen-gw1\\test_unpack_robustness_VENV__symlinks___whl_file_packed_')
❌ test_unpack_robustness[VENV (symlinks)-.whl file-zipapp]
tmpdir = Tempdir(path='C:\\Users\\runneradmin\\AppData\\Local\\Temp\\pytest-of-runneradmin\\pytest-0\\popen-gw1\\test_unpack_ro...ta\\Local\\Temp\\pytest-of-runneradmin\\pytest-0\\popen-gw1\\test_unpack_robustness_VENV__symlinks___whl_file_zipapp_')
❌ test_unpack_robustness[VENV (copies)-installed wheel chroot-packed]
tmpdir = Tempdir(path='C:\\Users\\runneradmin\\AppData\\Local\\Temp\\pytest-of-runneradmin\\pytest-0\\popen-gw1\\test_unpack_ro...Temp\\pytest-of-runneradmin\\pytest-0\\popen-gw1\\test_unpack_robustness_VENV__copies__installed_wheel_chroot_packed_')
❌ test_unpack_robustness[UNZIP-.whl file-zipapp]
tmpdir = Tempdir(path='C:\\Users\\runneradmin\\AppData\\Local\\Temp\\pytest-of-runneradmin\\pytest-0\\popen-gw0\\test_unpack_ro...min\\AppData\\Local\\Temp\\pytest-of-runneradmin\\pytest-0\\popen-gw0\\test_unpack_robustness_UNZIP__whl_file_zipapp_')
tests.integration.cli.commands.test_cache_prune
❌ test_zipapp_prune_shared_code
tmpdir = Tempdir(path='C:\\Users\\runneradmin\\AppData\\Local\\Temp\\pytest-of-runneradmin\\pytest-0\\popen-gw0\\test_zipapp_prune_shared_code0', symlink=None)
❌ test_zipapp_prune_shared_bootstrap
tmpdir = Tempdir(path='C:\\Users\\runneradmin\\AppData\\Local\\Temp\\pytest-of-runneradmin\\pytest-0\\popen-gw0\\test_zipapp_pr...rs\\runneradmin\\AppData\\Local\\Temp\\pytest-of-runneradmin\\pytest-0\\popen-gw0\\test_zipapp_prune_shared_bootstrap')
❌ test_installed_wheel_prune_build_time
pex = 'C:\\Users\\runneradmin\\AppData\\Local\\Temp\\pytest-of-runneradmin\\pytest-0\\popen-gw1\\test_installed_wheel_pru-46d4b0\\pex'
tests.integration.test_issue_1825
✅ test_pex_run_extra_sys_path[ZIPAPP]
tests.integration.test_issue_1479
❌ test_unicode_script_shebang_rewrite_docutils
tmpdir = Tempdir(path='C:\\Users\\runneradmin\\AppData\\Local\\Temp\\pytest-of-runneradmin\\pytest-0\\popen-gw1\\test_unicode_s...admin\\AppData\\Local\\Temp\\pytest-of-runneradmin\\pytest-0\\popen-gw1\\test_unicode_script_shebang_rewrite_docutils')
tests.integration.test_issue_1683
❌ test_requirements_pex
tmpdir = Tempdir(path='C:\\Users\\runneradmin\\AppData\\Local\\Temp\\pytest-of-runneradmin\\pytest-0\\popen-gw1\\test_requirements_pex0', symlink=None)
tests.integration.cli.commands.test_issue_2268
❌ test_abi_none_locking[pip-2020-resolver]
tmpdir = Tempdir(path='C:\\Users\\runneradmin\\AppData\\Local\\Temp\\pytest-of-runneradmin\\pytest-0\\popen-gw1\\test_abi_none_...nneradmin\\AppData\\Local\\Temp\\pytest-of-runneradmin\\pytest-0\\popen-gw1\\test_abi_none_locking_pip_2020_resolver_')
tests.integration.scie.test_pex_scie
❌ test_scie_busybox_console_scripts_remove_distribution
tmpdir = Tempdir(path='C:\\Users\\runneradmin\\AppData\\Local\\Temp\\pytest-of-runneradmin\\pytest-0\\popen-gw1\\test_scie_busy...pData\\Local\\Temp\\pytest-of-runneradmin\\pytest-0\\popen-gw1\\test_scie_busybox_console_scripts_remove_distribution')
❌ test_scie_busybox_console_script_inject_python_args[ZIPAPP]
tmpdir = Tempdir(path='C:\\Users\\runneradmin\\AppData\\Local\\Temp\\pytest-of-runneradmin\\pytest-0\\popen-gw1\\test_scie_busy...\Local\\Temp\\pytest-of-runneradmin\\pytest-0\\popen-gw1\\test_scie_busybox_console_script_inject_python_args_ZIPAPP_')
❌ test_basic[ZIPAPP-packed-eager]
tmpdir = Tempdir(path='C:\\Users\\runneradmin\\AppData\\Local\\Temp\\pytest-of-runneradmin\\pytest-0\\popen-gw0\\test_basic_ZIP...Users\\runneradmin\\AppData\\Local\\Temp\\pytest-of-runneradmin\\pytest-0\\popen-gw0\\test_basic_ZIPAPP_packed_eager_')
⚪ test_hashes
❌ test_basic[VENV-packed-eager]
tmpdir = Tempdir(path='C:\\Users\\runneradmin\\AppData\\Local\\Temp\\pytest-of-runneradmin\\pytest-0\\popen-gw1\\test_basic_VENV_packed_eager_0', symlink=None)
❌ test_basic[VENV-loose-eager]
tmpdir = Tempdir(path='C:\\Users\\runneradmin\\AppData\\Local\\Temp\\pytest-of-runneradmin\\pytest-0\\popen-gw0\\test_basic_VENV_loose_eager_0', symlink=None)
❌ test_basic[ZIPAPP-sh-boot-packed-eager]
tmpdir = Tempdir(path='C:\\Users\\runneradmin\\AppData\\Local\\Temp\\pytest-of-runneradmin\\pytest-0\\popen-gw1\\test_basic_ZIP...unneradmin\\AppData\\Local\\Temp\\pytest-of-runneradmin\\pytest-0\\popen-gw1\\test_basic_ZIPAPP_sh_boot_packed_eager_')
❌ test_basic[VENV-sh-boot-packed-eager]
tmpdir = Tempdir(path='C:\\Users\\runneradmin\\AppData\\Local\\Temp\\pytest-of-runneradmin\\pytest-0\\popen-gw0\\test_basic_VEN...\runneradmin\\AppData\\Local\\Temp\\pytest-of-runneradmin\\pytest-0\\popen-gw0\\test_basic_VENV_sh_boot_packed_eager_')
❌ test_basic[VENV-sh-boot-packed-lazy]
tmpdir = Tempdir(path='C:\\Users\\runneradmin\\AppData\\Local\\Temp\\pytest-of-runneradmin\\pytest-0\\popen-gw1\\test_basic_VEN...\\runneradmin\\AppData\\Local\\Temp\\pytest-of-runneradmin\\pytest-0\\popen-gw1\\test_basic_VENV_sh_boot_packed_lazy_')
❌ test_scie_only
tmpdir = Tempdir(path='C:\\Users\\runneradmin\\AppData\\Local\\Temp\\pytest-of-runneradmin\\pytest-0\\popen-gw1\\test_scie_only0', symlink=None)
❌ test_basic[ZIPAPP-sh-boot-packed-lazy]
tmpdir = Tempdir(path='C:\\Users\\runneradmin\\AppData\\Local\\Temp\\pytest-of-runneradmin\\pytest-0\\popen-gw1\\test_basic_ZIP...runneradmin\\AppData\\Local\\Temp\\pytest-of-runneradmin\\pytest-0\\popen-gw1\\test_basic_ZIPAPP_sh_boot_packed_lazy_')
❌ test_script_not_found
tmpdir = Tempdir(path='C:\\Users\\runneradmin\\AppData\\Local\\Temp\\pytest-of-runneradmin\\pytest-0\\popen-gw1\\test_script_not_found0', symlink=None)
❌ test_scie_name_style_platform_file_suffix
tmpdir = Tempdir(path='C:\\Users\\runneradmin\\AppData\\Local\\Temp\\pytest-of-runneradmin\\pytest-0\\popen-gw1\\test_scie_name...neradmin\\AppData\\Local\\Temp\\pytest-of-runneradmin\\pytest-0\\popen-gw1\\test_scie_name_style_platform_file_suffix')
tests.integration.test_issue_2183
⚪ test_lambdex_with_incompatible_attrs
tests.integration.venv_ITs.test_issue_2248
❌ test_repl_python_options[ZIPAPP]
execution_mode_args = []
tests.integration.test_issue_434
❌ test_entry_point_targeting
def test_entry_point_targeting():
tests.integration.test_issue_899
❌ test_top_level_environment_markers
tmpdir = Tempdir(path='C:\\Users\\runneradmin\\AppData\\Local\\Temp\\pytest-of-runneradmin\\pytest-0\\popen-gw1\\test_top_level...rs\\runneradmin\\AppData\\Local\\Temp\\pytest-of-runneradmin\\pytest-0\\popen-gw1\\test_top_level_environment_markers')
tests.integration.test_setproctitle
❌ test_setproctitle[.whl file-zipapp-VENV]
tmpdir = Tempdir(path='C:\\Users\\runneradmin\\AppData\\Local\\Temp\\pytest-of-runneradmin\\pytest-0\\popen-gw1\\test_setprocti...nneradmin\\AppData\\Local\\Temp\\pytest-of-runneradmin\\pytest-0\\popen-gw1\\test_setproctitle__whl_file_zipapp_VENV_')
❌ test_setproctitle[installed wheel chroot-zipapp-VENV]
tmpdir = Tempdir(path='C:\\Users\\runneradmin\\AppData\\Local\\Temp\\pytest-of-runneradmin\\pytest-0\\popen-gw1\\test_setprocti...pData\\Local\\Temp\\pytest-of-runneradmin\\pytest-0\\popen-gw1\\test_setproctitle_installed_wheel_chroot_zipapp_VENV_')
❌ test_setproctitle[.whl file-zipapp-UNZIP]
tmpdir = Tempdir(path='C:\\Users\\runneradmin\\AppData\\Local\\Temp\\pytest-of-runneradmin\\pytest-0\\popen-gw0\\test_setprocti...neradmin\\AppData\\Local\\Temp\\pytest-of-runneradmin\\pytest-0\\popen-gw0\\test_setproctitle__whl_file_zipapp_UNZIP_')
❌ test_setproctitle[installed wheel chroot-loose-UNZIP]
tmpdir = Tempdir(path='C:\\Users\\runneradmin\\AppData\\Local\\Temp\\pytest-of-runneradmin\\pytest-0\\popen-gw1\\test_setprocti...pData\\Local\\Temp\\pytest-of-runneradmin\\pytest-0\\popen-gw1\\test_setproctitle_installed_wheel_chroot_loose_UNZIP_')
❌ test_setproctitle[installed wheel chroot-packed-UNZIP]
tmpdir = Tempdir(path='C:\\Users\\runneradmin\\AppData\\Local\\Temp\\pytest-of-runneradmin\\pytest-0\\popen-gw0\\test_setprocti...Data\\Local\\Temp\\pytest-of-runneradmin\\pytest-0\\popen-gw0\\test_setproctitle_installed_wheel_chroot_packed_UNZIP_')
tests.integration.test_interpreter_selection
✅ test_interpreter_resolution_with_multiple_constraint_options
✅ test_interpreter_constraints_to_pex_info_py2
✅ test_pex_exec_with_pex_python_path_and_pex_python_but_no_constraints
✅ test_interpreter_constraints_to_pex_info_py3
tests.integration.test_layout
❌ test_resiliency[.whl file-loose-VENV]
tmpdir = Tempdir(path='C:\\Users\\runneradmin\\AppData\\Local\\Temp\\pytest-of-runneradmin\\pytest-0\\popen-gw0\\test_resilienc...\runneradmin\\AppData\\Local\\Temp\\pytest-of-runneradmin\\pytest-0\\popen-gw0\\test_resiliency__whl_file_loose_VENV_')
tests.integration.test_issue_1201
❌ test_old_requires_metadata_used_for_requires_python
tmpdir = Tempdir(path='C:\\Users\\runneradmin\\AppData\\Local\\Temp\\pytest-of-runneradmin\\pytest-0\\popen-gw1\\test_old_requi...AppData\\Local\\Temp\\pytest-of-runneradmin\\pytest-0\\popen-gw1\\test_old_requires_metadata_used_for_requires_python')
tests.integration.test_issue_2006
❌ test_symlink_preserved_in_argv0[__main__.py boot]
tmpdir = Tempdir(path='C:\\Users\\runneradmin\\AppData\\Local\\Temp\\pytest-of-runneradmin\\pytest-0\\popen-gw0\\test_symlink_p...\\AppData\\Local\\Temp\\pytest-of-runneradmin\\pytest-0\\popen-gw0\\test_symlink_preserved_in_argv0___main___py_boot_')
tests.integration.test_issue_2389
❌ test_lock_use_no_build_wheel
tmpdir = Tempdir(path='C:\\Users\\runneradmin\\AppData\\Local\\Temp\\pytest-of-runneradmin\\pytest-0\\popen-gw0\\test_lock_use_no_build_wheel1', symlink=None)
tests.integration.test_issue_2235
❌ test_standard_library_is_included
tmpdir = Tempdir(path='C:\\Users\\runneradmin\\AppData\\Local\\Temp\\pytest-of-runneradmin\\pytest-0\\popen-gw1\\test_standard_...ers\\runneradmin\\AppData\\Local\\Temp\\pytest-of-runneradmin\\pytest-0\\popen-gw1\\test_standard_library_is_included')
tests.integration.cli.commands.test_venv_create
❌ test_venv_update_target_mismatch
def bootstrap_pip():
✅ test_flat_zipped_empty
❌ test_flat_zipped_prefix
td = Tempdir(path='C:\\Users\\runneradmin\\AppData\\Local\\Temp\\pytest-of-runneradmin\\pytest-0\\popen-gw1\\td_test_venv_create_py0', symlink=None)
tests.integration.venv_ITs.test_issue_1745
❌ test_interpreter_mode_python_options[- (<code> from STDIN)-ZIPAPP]
execution_mode_args = []
tests.integration.test_overrides
❌ test_pex_repository_override
tmpdir = Tempdir(path='C:\\Users\\runneradmin\\AppData\\Local\\Temp\\pytest-of-runneradmin\\pytest-0\\popen-gw1\\test_pex_repository_override0', symlink=None)
tests.integration.test_script_metadata
❌ test_targets_additive
tmpdir = Tempdir(path='C:\\Users\\runneradmin\\AppData\\Local\\Temp\\pytest-of-runneradmin\\pytest-0\\popen-gw0\\test_targets_additive0', symlink=None)
tests.integration.test_issue_898
❌ test_top_level_requirements_requires_python_env_markers
def test_top_level_requirements_requires_python_env_markers():
tests.integration.test_issue_1540
❌ test_derive_consistent_shebang_platforms
tmpdir = Tempdir(path='C:\\Users\\runneradmin\\AppData\\Local\\Temp\\pytest-of-runneradmin\\pytest-0\\popen-gw1\\test_derive_co...nneradmin\\AppData\\Local\\Temp\\pytest-of-runneradmin\\pytest-0\\popen-gw1\\test_derive_consistent_shebang_platforms')
tests.integration.resolve.test_dependency_groups
❌ test_pex_from_dependency_groups
tmpdir = Tempdir(path='C:\\Users\\runneradmin\\AppData\\Local\\Temp\\pytest-of-runneradmin\\pytest-0\\popen-gw0\\test_pex_from_...Users\\runneradmin\\AppData\\Local\\Temp\\pytest-of-runneradmin\\pytest-0\\popen-gw0\\test_pex_from_dependency_groups')
tests.integration.test_no_pre_install_wheels
❌ test_no_pre_install_wheels
tmpdir = Tempdir(path='C:\\Users\\runneradmin\\AppData\\Local\\Temp\\pytest-of-runneradmin\\pytest-0\\popen-gw0\\test_no_pre_install_wheels0', symlink=None)
tests.integration.test_issue_1018
❌ test_execute_module_alter_sys[no-ep-zipapp-VENV]
tmpdir = Tempdir(path='C:\\Users\\runneradmin\\AppData\\Local\\Temp\\pytest-of-runneradmin\\pytest-0\\popen-gw0\\test_execute_m...n\\AppData\\Local\\Temp\\pytest-of-runneradmin\\pytest-0\\popen-gw0\\test_execute_module_alter_sys_no_ep_zipapp_VENV_')
❌ test_execute_module_alter_sys[ep-function-zipapp-PEX]
tmpdir = Tempdir(path='C:\\Users\\runneradmin\\AppData\\Local\\Temp\\pytest-of-runneradmin\\pytest-0\\popen-gw1\\test_execute_m...pData\\Local\\Temp\\pytest-of-runneradmin\\pytest-0\\popen-gw1\\test_execute_module_alter_sys_ep_function_zipapp_PEX_')
❌ test_execute_module_alter_sys[ep-module-packed-PEX]
tmpdir = Tempdir(path='C:\\Users\\runneradmin\\AppData\\Local\\Temp\\pytest-of-runneradmin\\pytest-0\\popen-gw0\\test_execute_m...AppData\\Local\\Temp\\pytest-of-runneradmin\\pytest-0\\popen-gw0\\test_execute_module_alter_sys_ep_module_packed_PEX_')
❌ test_execute_module_alter_sys[ep-function-zipapp-VENV]
tmpdir = Tempdir(path='C:\\Users\\runneradmin\\AppData\\Local\\Temp\\pytest-of-runneradmin\\pytest-0\\popen-gw1\\test_execute_m...Data\\Local\\Temp\\pytest-of-runneradmin\\pytest-0\\popen-gw1\\test_execute_module_alter_sys_ep_function_zipapp_VENV_')
❌ test_execute_module_alter_sys[ep-function-loose-VENV]
tmpdir = Tempdir(path='C:\\Users\\runneradmin\\AppData\\Local\\Temp\\pytest-of-runneradmin\\pytest-0\\popen-gw0\\test_execute_m...pData\\Local\\Temp\\pytest-of-runneradmin\\pytest-0\\popen-gw0\\test_execute_module_alter_sys_ep_function_loose_VENV_')
tests.integration.test_reexec
✅ test_pex_no_reexec_no_constraints
tests.integration.test_variables
❌ test_pex_variable_always_defined_at_runtime[UNZIP-loose-StripPexEnv]
pex_project_dir = 'D:/a/pex/pex/repo'
❌ test_pex_variable_always_defined_at_runtime[VENV-loose-StripPexEnv]
pex_project_dir = 'D:/a/pex/pex/repo'
❌ test_pex_variable_always_defined_at_runtime[VENV-packed-NoStripPexEnv]
pex_project_dir = 'D:/a/pex/pex/repo'
tests.integration.test_locked_resolve
❌ test_lock_single_target[sources-float-transitive-deps]
tmpdir = Tempdir(path='C:\\Users\\runneradmin\\AppData\\Local\\Temp\\pytest-of-runneradmin\\pytest-0\\popen-gw1\\test_lock_sing...Data\\Local\\Temp\\pytest-of-runneradmin\\pytest-0\\popen-gw1\\test_lock_single_target_sources_float_transitive_deps_')
tests.integration.cli.commands.test_lock_update_issues_2332_2334
❌ test_lock_update_nominal
run_lock_update = <function lock_fixtures.<locals>.run_lock_update_on_copy at 0x0000023D54D78C20>
❌ test_lock_update_replace
run_lock_update = <function lock_fixtures.<locals>.run_lock_update_on_copy at 0x000001FB54123240>
❌ test_lock_update_conflict
run_lock_update = <function lock_fixtures.<locals>.run_lock_update_on_copy at 0x000001FB540D3600>
❌ test_lock_delete_complex
run_lock_update = <function lock_fixtures.<locals>.run_lock_update_on_copy at 0x0000023D54D75440>
tests.integration.test_issue_1879
✅ test_overwrite[zipapp-.whl file-loose-installed wheel chroot]
✅ test_overwrite[packed-installed wheel chroot-loose-installed wheel chroot]
✅ test_overwrite[zipapp-installed wheel chroot-zipapp-installed wheel chroot]
✅ test_overwrite[loose-.whl file-packed-.whl file]
✅ test_overwrite[zipapp-.whl file-zipapp-installed wheel chroot]
✅ test_overwrite[loose-installed wheel chroot-packed-installed wheel chroot]
✅ test_overwrite[packed-.whl file-packed-.whl file]
tests.integration.test_pep_427
❌ test_install_scripts
tmpdir = Tempdir(path='C:\\Users\\runneradmin\\AppData\\Local\\Temp\\pytest-of-runneradmin\\pytest-0\\popen-gw0\\test_install_scripts0', symlink=None)
tests.integration.cli.commands.test_export
❌ test_export_sort_by
tmpdir = Tempdir(path='C:\\Users\\runneradmin\\AppData\\Local\\Temp\\pytest-of-runneradmin\\pytest-0\\popen-gw1\\test_export_sort_by0', symlink=None)
❌ test_export_single_artifact
tmpdir = Tempdir(path='C:\\Users\\runneradmin\\AppData\\Local\\Temp\\pytest-of-runneradmin\\pytest-0\\popen-gw0\\test_export_single_artifact0', symlink=None)
❌ test_export_normalizes_name_but_not_version
tmpdir = Tempdir(path='C:\\Users\\runneradmin\\AppData\\Local\\Temp\\pytest-of-runneradmin\\pytest-0\\popen-gw0\\test_export_no...radmin\\AppData\\Local\\Temp\\pytest-of-runneradmin\\pytest-0\\popen-gw0\\test_export_normalizes_name_but_not_version')
❌ test_export_multiple_artifacts
tmpdir = Tempdir(path='C:\\Users\\runneradmin\\AppData\\Local\\Temp\\pytest-of-runneradmin\\pytest-0\\popen-gw1\\test_export_multiple_artifacts0', symlink=None)
tests.integration.test_downloads
✅ test_issue_1849_download_foreign_artifact
tests.integration.test_issue_2134
✅ test_add_package_offset
tests.integration.cli.commands.test_issue_1821
❌ test_non_universal_target_system_unsupported[strict]
style = 'strict'
tests.integration.test_inject_env_and_args
✅ test_inject_env_invalid
❌ dist/test-results/integration-2.xml
225 tests were completed in 1030s with 32 passed, 172 failed and 21 skipped.
Test suite | Passed | Failed | Skipped | Time |
---|---|---|---|---|
pytest | 32✅ | 172❌ | 21⚪ | 1030s |
❌ pytest
❌ tests.integration.test_issue_2073
pex\pip\installation.py:262: in bootstrap_pip
⚪ tests.integration.test_sh_boot
⚪ tests.integration.test_shebang_length_limit
tests.integration.cli.commands.test_issue_2098
❌ test_missing_download_lock_analysis_handling
@pytest.fixture
tests.integration.test_issue_2348
❌ test_find_links_url_escaping
tmpdir = Tempdir(path='C:\\Users\\runneradmin\\AppData\\Local\\Temp\\pytest-of-runneradmin\\pytest-0\\popen-gw0\\test_find_links_url_escaping0', symlink=None)
tests.integration.test_lock_resolver
❌ test_multiplatform
tmpdir = Tempdir(path='C:\\Users\\runneradmin\\AppData\\Local\\Temp\\pytest-of-runneradmin\\pytest-0\\popen-gw1\\test_multiplatform0', symlink=None)
✅ test_empty_lock_issue_1659
tests.integration.cli.commands.test_issue_1821
❌ test_target_system_platform_specific
tmpdir = Tempdir(path='C:\\Users\\runneradmin\\AppData\\Local\\Temp\\pytest-of-runneradmin\\pytest-0\\popen-gw1\\test_target_sy...\\runneradmin\\AppData\\Local\\Temp\\pytest-of-runneradmin\\pytest-0\\popen-gw1\\test_target_system_platform_specific')
tests.integration.cli.commands.test_lock_reproducibility_hash_seed
❌ test_reproducibility_hostile_project_lock
tmpdir = Tempdir(path='C:\\Users\\runneradmin\\AppData\\Local\\Temp\\pytest-of-runneradmin\\pytest-0\\popen-gw0\\test_reproduci...neradmin\\AppData\\Local\\Temp\\pytest-of-runneradmin\\pytest-0\\popen-gw0\\test_reproducibility_hostile_project_lock')
❌ test_reproducibility_hostile_vcs_lock
tmpdir = Tempdir(path='C:\\Users\\runneradmin\\AppData\\Local\\Temp\\pytest-of-runneradmin\\pytest-0\\popen-gw0\\test_reproduci...\runneradmin\\AppData\\Local\\Temp\\pytest-of-runneradmin\\pytest-0\\popen-gw0\\test_reproducibility_hostile_vcs_lock')
tests.integration.test_issue_2412
⚪ test_bdist_pex_locked_issue_2412_repro_exact
tests.integration.cli.commands.test_local_project_lock
❌ test_fingerprint_stability
tmpdir = Tempdir(path='C:\\Users\\runneradmin\\AppData\\Local\\Temp\\pytest-of-runneradmin\\pytest-0\\popen-gw0\\test_fingerprint_stability0', symlink=None)
❌ test_path_mappings
tmpdir = Tempdir(path='C:\\Users\\runneradmin\\AppData\\Local\\Temp\\pytest-of-runneradmin\\pytest-0\\popen-gw1\\test_path_mappings0', symlink=None)
tests.integration.test_issue_157
❌ test_empty_pex_no_args[IS_TTY-scie-VENV]
tmpdir = Tempdir(path='C:\\Users\\runneradmin\\AppData\\Local\\Temp\\pytest-of-runneradmin\\pytest-0\\popen-gw1\\test_empty_pex...nneradmin\\AppData\\Local\\Temp\\pytest-of-runneradmin\\pytest-0\\popen-gw1\\test_empty_pex_no_args_IS_TTY_scie_VENV_')
❌ test_empty_pex_no_args[TERM=dumb-scie-VENV]
tmpdir = Tempdir(path='C:\\Users\\runneradmin\\AppData\\Local\\Temp\\pytest-of-runneradmin\\pytest-0\\popen-gw1\\test_empty_pex...radmin\\AppData\\Local\\Temp\\pytest-of-runneradmin\\pytest-0\\popen-gw1\\test_empty_pex_no_args_TERM_dumb_scie_VENV_')
❌ test_pex_with_deps[VENV]
tmpdir = Tempdir(path='C:\\Users\\runneradmin\\AppData\\Local\\Temp\\pytest-of-runneradmin\\pytest-0\\popen-gw0\\test_pex_with_deps_VENV_0', symlink=None)
❌ test_pex_info_command_loose_venv_pex_directory
tmpdir = Tempdir(path='C:\\Users\\runneradmin\\AppData\\Local\\Temp\\pytest-of-runneradmin\\pytest-0\\popen-gw0\\test_pex_info_...min\\AppData\\Local\\Temp\\pytest-of-runneradmin\\pytest-0\\popen-gw0\\test_pex_info_command_loose_venv_pex_directory')
❌ test_pex_info_command_venv_pex_file
tmpdir = Tempdir(path='C:\\Users\\runneradmin\\AppData\\Local\\Temp\\pytest-of-runneradmin\\pytest-0\\popen-gw0\\test_pex_info_...s\\runneradmin\\AppData\\Local\\Temp\\pytest-of-runneradmin\\pytest-0\\popen-gw0\\test_pex_info_command_venv_pex_file')
❌ test_empty_pex_no_args[IS_TTY-traditional-VENV]
tmpdir = Tempdir(path='C:\\Users\\runneradmin\\AppData\\Local\\Temp\\pytest-of-runneradmin\\pytest-0\\popen-gw0\\test_empty_pex...in\\AppData\\Local\\Temp\\pytest-of-runneradmin\\pytest-0\\popen-gw0\\test_empty_pex_no_args_IS_TTY_traditional_VENV_')
tests.integration.test_reproducible
❌ test_reproducible_build_sdist_requirements
major_compatible_pythons = ('D:\\a\\pex\\pex\\repo\\.tox\\py313-pip25_0-integration\\Scripts\\python.EXE', 'D:\\a\\pex\\pex\\.pex_dev\\pyenv-win\...nv-win\\versions\\3.9.13\\python.exe', 'D:\\a\\pex\\pex\\.pex_dev\\pyenv-win\\pyenv-win\\versions\\3.10.7\\python.exe')
❌ test_reproducible_build_m_flag
@pytest.fixture(scope="module")
❌ test_reproducible_build_python_shebang_flag
def test_reproducible_build_python_shebang_flag():
tests.integration.scie.test_discussion_2516
❌ test_discussion_2516_op
tmpdir = Tempdir(path='C:\\Users\\runneradmin\\AppData\\Local\\Temp\\pytest-of-runneradmin\\pytest-0\\popen-gw1\\test_discussion_2516_op0', symlink=None)
tests.integration.test_issue_2413
❌ test_bdist_pex_under_tox
tmpdir = Tempdir(path='C:\\Users\\runneradmin\\AppData\\Local\\Temp\\pytest-of-runneradmin\\pytest-0\\popen-gw0\\test_bdist_pex_under_tox0', symlink=None)
❌ test_venv_with_installs[wheel:upgraded-setuptools:upgraded-pip:upgraded]
tmpdir = Tempdir(path='C:\\Users\\runneradmin\\AppData\\Local\\Temp\\pytest-of-runneradmin\\pytest-0\\popen-gw0\\test_venv_with...\pytest-of-runneradmin\\pytest-0\\popen-gw0\\test_venv_with_installs_wheel_upgraded_setuptools_upgraded_pip_upgraded_')
❌ test_venv_with_installs[wheel:yes-setuptools:no-pip:upgraded]
tmpdir = Tempdir(path='C:\\Users\\runneradmin\\AppData\\Local\\Temp\\pytest-of-runneradmin\\pytest-0\\popen-gw1\\test_venv_with...ocal\\Temp\\pytest-of-runneradmin\\pytest-0\\popen-gw1\\test_venv_with_installs_wheel_yes_setuptools_no_pip_upgraded_')
tests.integration.resolve.test_issue_2532
⚪ test_resolved_wheel_tag_platform_mismatch_warns
tests.integration.cli.commands.test_lock
❌ test_create_vcs
tmpdir = Tempdir(path='C:\\Users\\runneradmin\\AppData\\Local\\Temp\\pytest-of-runneradmin\\pytest-0\\popen-gw0\\test_create_vcs0', symlink=None)
❌ test_update_add_impossible
def bootstrap_pip():
❌ test_update_targeted_add_dry_run
lock_file_path = 'C:\\Users\\runneradmin\\AppData\\Local\\Temp\\pytest-of-runneradmin\\pytest-0\\popen-gw1\\test_update_targeted_add-4ad860\\lock.json'
❌ test_update_targeted_impossible
lock_file_path = 'C:\\Users\\runneradmin\\AppData\\Local\\Temp\\pytest-of-runneradmin\\pytest-0\\popen-gw1\\test_update_targeted_imp-e3c890\\lock.json'
❌ test_update_targeted_upgrade
lock_file_path = 'C:\\Users\\runneradmin\\AppData\\Local\\Temp\\pytest-of-runneradmin\\pytest-0\\popen-gw0\\test_update_targeted_upgrade0\\lock.json'
❌ test_update_targeted_upgrade_dry_run_check
lock_file_path = 'C:\\Users\\runneradmin\\AppData\\Local\\Temp\\pytest-of-runneradmin\\pytest-0\\popen-gw1\\test_update_targeted_upg-756c20\\lock.json'
tests.integration.test_integration
❌ test_pex_manylinux_and_tag_selection_linux_msgpack
def test_pex_manylinux_and_tag_selection_linux_msgpack():
❌ test_pex_manylinux_and_tag_selection_lxml_osx
def test_pex_manylinux_and_tag_selection_lxml_osx():
⚪ test_require_hashes
❌ test_inherit_path_prefer
def test_inherit_path_prefer():
❌ test_seed_verbose[Python-installed wheel chroot-zipapp-PEX]
isort_pex_args = ('C:\\Users\\runneradmin\\AppData\\Local\\Temp\\pytest-of-runneradmin\\pytest-0\\popen-gw1\\test_seed_verbose_Python-b...n<'3.6'", "setuptools==44.1.1; python_version<'3.6'", "isort==5.6.4; python_version>='3.6'", '-c', 'isort', '-o', ...])
❌ test_seed_verbose[Direct-installed wheel chroot-packed-PEX]
isort_pex_args = ('C:\\Users\\runneradmin\\AppData\\Local\\Temp\\pytest-of-runneradmin\\pytest-0\\popen-gw0\\test_seed_verbose_Direct-2...n<'3.6'", "setuptools==44.1.1; python_version<'3.6'", "isort==5.6.4; python_version>='3.6'", '-c', 'isort', '-o', ...])
⚪ test_requirement_file_from_url
❌ test_entry_point_exit_code
tmpdir = Tempdir(path='C:\\Users\\runneradmin\\AppData\\Local\\Temp\\pytest-of-runneradmin\\pytest-0\\popen-gw0\\test_entry_point_exit_code0', symlink=None)
❌ test_trusted_host_handling
def test_trusted_host_handling():
❌ test_binary_scripts[installed wheel chroot-zipapp-PEX]
tmpdir = Tempdir(path='C:\\Users\\runneradmin\\AppData\\Local\\Temp\\pytest-of-runneradmin\\pytest-0\\popen-gw0\\test_binary_sc...Data\\Local\\Temp\\pytest-of-runneradmin\\pytest-0\\popen-gw0\\test_binary_scripts_installed_wheel_chroot_zipapp_PEX_')
❌ test_pex_repl_cli
def test_pex_repl_cli():
⚪ test_cross_platform_abi_targeting_behavior_exact
❌ test_seed[installed wheel chroot-packed-PEX]
isort_pex_args = ('C:\\Users\\runneradmin\\AppData\\Local\\Temp\\pytest-of-runneradmin\\pytest-0\\popen-gw0\\test_seed_installed_whee-4...n<'3.6'", "setuptools==44.1.1; python_version<'3.6'", "isort==5.6.4; python_version>='3.6'", '-c', 'isort', '-o', ...])
❌ test_seed[.whl file-packed-PEX]
isort_pex_args = ('C:\\Users\\runneradmin\\AppData\\Local\\Temp\\pytest-of-runneradmin\\pytest-0\\popen-gw0\\test_seed__whl_file_pack-0...n<'3.6'", "setuptools==44.1.1; python_version<'3.6'", "isort==5.6.4; python_version>='3.6'", '-c', 'isort', '-o', ...])
❌ test_no_emit_warnings_verbose_override
def test_no_emit_warnings_verbose_override():
❌ test_binary_scripts[.whl file-zipapp-PEX]
tmpdir = Tempdir(path='C:\\Users\\runneradmin\\AppData\\Local\\Temp\\pytest-of-runneradmin\\pytest-0\\popen-gw0\\test_binary_sc...neradmin\\AppData\\Local\\Temp\\pytest-of-runneradmin\\pytest-0\\popen-gw0\\test_binary_scripts__whl_file_zipapp_PEX_')
❌ test_binary_scripts[.whl file-loose-VENV]
tmpdir = Tempdir(path='C:\\Users\\runneradmin\\AppData\\Local\\Temp\\pytest-of-runneradmin\\pytest-0\\popen-gw0\\test_binary_sc...neradmin\\AppData\\Local\\Temp\\pytest-of-runneradmin\\pytest-0\\popen-gw0\\test_binary_scripts__whl_file_loose_VENV_')
❌ test_binary_scripts[installed wheel chroot-packed-PEX]
tmpdir = Tempdir(path='C:\\Users\\runneradmin\\AppData\\Local\\Temp\\pytest-of-runneradmin\\pytest-0\\popen-gw1\\test_binary_sc...Data\\Local\\Temp\\pytest-of-runneradmin\\pytest-0\\popen-gw1\\test_binary_scripts_installed_wheel_chroot_packed_PEX_')
❌ test_entry_point_verification_3rdparty[.whl file-loose]
tmpdir = Tempdir(path='C:\\Users\\runneradmin\\AppData\\Local\\Temp\\pytest-of-runneradmin\\pytest-0\\popen-gw0\\test_entry_poi...ata\\Local\\Temp\\pytest-of-runneradmin\\pytest-0\\popen-gw0\\test_entry_point_verification_3rdparty__whl_file_loose_')
❌ test_seed[.whl file-zipapp-VENV]
isort_pex_args = ('C:\\Users\\runneradmin\\AppData\\Local\\Temp\\pytest-of-runneradmin\\pytest-0\\popen-gw0\\test_seed__whl_file_zipa-c...n<'3.6'", "setuptools==44.1.1; python_version<'3.6'", "isort==5.6.4; python_version>='3.6'", '-c', 'isort', '-o', ...])
✅ test_invalid_entry_point_verification_3rdparty[.whl file-packed]
⚪ test_pex_python_symlink
✅ test_pex_source_bundling
❌ test_entry_point_verification_3rdparty[.whl file-packed]
tmpdir = Tempdir(path='C:\\Users\\runneradmin\\AppData\\Local\\Temp\\pytest-of-runneradmin\\pytest-0\\popen-gw0\\test_entry_poi...ta\\Local\\Temp\\pytest-of-runneradmin\\pytest-0\\popen-gw0\\test_entry_point_verification_3rdparty__whl_file_packed_')
❌ test_binary_scripts[installed wheel chroot-loose-VENV]
tmpdir = Tempdir(path='C:\\Users\\runneradmin\\AppData\\Local\\Temp\\pytest-of-runneradmin\\pytest-0\\popen-gw1\\test_binary_sc...Data\\Local\\Temp\\pytest-of-runneradmin\\pytest-0\\popen-gw1\\test_binary_scripts_installed_wheel_chroot_loose_VENV_')
❌ test_seed[installed wheel chroot-zipapp-VENV]
isort_pex_args = ('C:\\Users\\runneradmin\\AppData\\Local\\Temp\\pytest-of-runneradmin\\pytest-0\\popen-gw0\\test_seed_installed_whee-1...n<'3.6'", "setuptools==44.1.1; python_version<'3.6'", "isort==5.6.4; python_version>='3.6'", '-c', 'isort', '-o', ...])
❌ test_binary_scripts[.whl file-packed-VENV]
tmpdir = Tempdir(path='C:\\Users\\runneradmin\\AppData\\Local\\Temp\\pytest-of-runneradmin\\pytest-0\\popen-gw1\\test_binary_sc...eradmin\\AppData\\Local\\Temp\\pytest-of-runneradmin\\pytest-0\\popen-gw1\\test_binary_scripts__whl_file_packed_VENV_')
❌ test_entry_point_verification_3rdparty[installed wheel chroot-loose]
tmpdir = Tempdir(path='C:\\Users\\runneradmin\\AppData\\Local\\Temp\\pytest-of-runneradmin\\pytest-0\\popen-gw0\\test_entry_poi...emp\\pytest-of-runneradmin\\pytest-0\\popen-gw0\\test_entry_point_verification_3rdparty_installed_wheel_chroot_loose_')
❌ test_binary_scripts[installed wheel chroot-packed-VENV]
tmpdir = Tempdir(path='C:\\Users\\runneradmin\\AppData\\Local\\Temp\\pytest-of-runneradmin\\pytest-0\\popen-gw1\\test_binary_sc...ata\\Local\\Temp\\pytest-of-runneradmin\\pytest-0\\popen-gw1\\test_binary_scripts_installed_wheel_chroot_packed_VENV_')
tests.integration.cli.commands.test_cache_prune
❌ test_venv_prune_wheel_copies
tmpdir = Tempdir(path='C:\\Users\\runneradmin\\AppData\\Local\\Temp\\pytest-of-runneradmin\\pytest-0\\popen-gw1\\test_venv_prune_wheel_copies0', symlink=None)
❌ test_zipapp_prune_shared_deps
tmpdir = Tempdir(path='C:\\Users\\runneradmin\\AppData\\Local\\Temp\\pytest-of-runneradmin\\pytest-0\\popen-gw1\\test_zipapp_prune_shared_deps0', symlink=None)
❌ test_app_prune
tmpdir = Tempdir(path='C:\\Users\\runneradmin\\AppData\\Local\\Temp\\pytest-of-runneradmin\\pytest-0\\popen-gw0\\test_app_prune0', symlink=None)
tests.integration.test_interpreter_selection
❌ test_interpreter_selection_using_os_environ_for_bootstrap_reexec
tmpdir = Tempdir(path='C:\\Users\\runneradmin\\AppData\\Local\\Temp\\pytest-of-runneradmin\\pytest-0\\popen-gw0\\test_interpret...l\\Temp\\pytest-of-runneradmin\\pytest-0\\popen-gw0\\test_interpreter_selection_using_os_environ_for_bootstrap_reexec')
❌ test_interpreter_resolution_pex_python_path_precedence_over_pex_python
tmpdir = Tempdir(path='C:\\Users\\runneradmin\\AppData\\Local\\Temp\\pytest-of-runneradmin\\pytest-0\\popen-gw0\\test_interpret...p\\pytest-of-runneradmin\\pytest-0\\popen-gw0\\test_interpreter_resolution_pex_python_path_precedence_over_pex_python')
✅ test_interpreter_resolution_with_constraint_option
tests.integration.test_issue_1031
❌ test_setuptools_isolation_with_system_site_packages[pyvenv]
create_venv = <function <lambda> at 0x0000014DA3D90F40>
tests.integration.resolve.test_issue_1918
⚪ test_redacted_requirement_handling[24.1.1-pip-2020-resolver-direct-reference]
⚪ test_redacted_requirement_handling[24.2-pip-2020-resolver-pip-proprietary]
⚪ test_redacted_requirement_handling[24.1-pip-2020-resolver-direct-reference]
⚪ test_redacted_requirement_handling[24.3-pip-2020-resolver-pip-proprietary]
⚪ test_redacted_requirement_handling[25.0-pip-2020-resolver-pip-proprietary]
tests.integration.cli.commands.test_issue_2057
❌ test_lock_create_local_project_direct_reference[Subset [Pip Proprietary]-Create Lock [Pip Proprietary]]
tmpdir = Tempdir(path='C:\\Users\\runneradmin\\AppData\\Local\\Temp\\pytest-of-runneradmin\\pytest-0\\popen-gw0\\test_lock_crea...0\\popen-gw0\\test_lock_create_local_project_direct_reference_Subset__Pip_Proprietary__Create_Lock__Pip_Proprietary__')
❌ test_lock_create_archive_direct_reference[Subset [Pip Proprietary]-Create Lock [PEP-508]]
tmpdir = Tempdir(path='C:\\Users\\runneradmin\\AppData\\Local\\Temp\\pytest-of-runneradmin\\pytest-0\\popen-gw0\\test_lock_crea...admin\\pytest-0\\popen-gw0\\test_lock_create_archive_direct_reference_Subset__Pip_Proprietary__Create_Lock__PEP_508__')
❌ test_lock_create_archive_direct_reference[Subset [PEP-508]-Create Lock [PEP-508]]
tmpdir = Tempdir(path='C:\\Users\\runneradmin\\AppData\\Local\\Temp\\pytest-of-runneradmin\\pytest-0\\popen-gw0\\test_lock_crea...f-runneradmin\\pytest-0\\popen-gw0\\test_lock_create_archive_direct_reference_Subset__PEP_508__Create_Lock__PEP_508__')
❌ test_pex_archive_direct_reference[Create Pex [Pip Proprietary]]
tmpdir = Tempdir(path='C:\\Users\\runneradmin\\AppData\\Local\\Temp\\pytest-of-runneradmin\\pytest-0\\popen-gw1\\test_pex_archi...al\\Temp\\pytest-of-runneradmin\\pytest-0\\popen-gw1\\test_pex_archive_direct_reference_Create_Pex__Pip_Proprietary__')
tests.integration.scie.test_pex_scie
❌ test_multiple_platforms
tmpdir = Tempdir(path='C:\\Users\\runneradmin\\AppData\\Local\\Temp\\pytest-of-runneradmin\\pytest-0\\popen-gw0\\test_multiple_platforms0', symlink=None)
❌ test_custom_lazy_urls
tmpdir = Tempdir(path='C:\\Users\\runneradmin\\AppData\\Local\\Temp\\pytest-of-runneradmin\\pytest-0\\popen-gw0\\test_custom_lazy_urls0', symlink=None)
❌ test_scie_name_style_platform_parent_dir
tmpdir = Tempdir(path='C:\\Users\\runneradmin\\AppData\\Local\\Temp\\pytest-of-runneradmin\\pytest-0\\popen-gw0\\test_scie_name...nneradmin\\AppData\\Local\\Temp\\pytest-of-runneradmin\\pytest-0\\popen-gw0\\test_scie_name_style_platform_parent_dir')
❌ test_scie_busybox_console_scripts_add_distribution
tmpdir = Tempdir(path='C:\\Users\\runneradmin\\AppData\\Local\\Temp\\pytest-of-runneradmin\\pytest-0\\popen-gw0\\test_scie_busy...\AppData\\Local\\Temp\\pytest-of-runneradmin\\pytest-0\\popen-gw0\\test_scie_busybox_console_scripts_add_distribution')
❌ test_basic[VENV-sh-boot-zipapp-eager]
tmpdir = Tempdir(path='C:\\Users\\runneradmin\\AppData\\Local\\Temp\\pytest-of-runneradmin\\pytest-0\\popen-gw0\\test_basic_VEN...\runneradmin\\AppData\\Local\\Temp\\pytest-of-runneradmin\\pytest-0\\popen-gw0\\test_basic_VENV_sh_boot_zipapp_eager_')
❌ test_scie_busybox_console_scripts_all[VENV]
tmpdir = Tempdir(path='C:\\Users\\runneradmin\\AppData\\Local\\Temp\\pytest-of-runneradmin\\pytest-0\\popen-gw0\\test_scie_busy...radmin\\AppData\\Local\\Temp\\pytest-of-runneradmin\\pytest-0\\popen-gw0\\test_scie_busybox_console_scripts_all_VENV_')
❌ test_scie_busybox_console_script_inject_python_args[VENV]
tmpdir = Tempdir(path='C:\\Users\\runneradmin\\AppData\\Local\\Temp\\pytest-of-runneradmin\\pytest-0\\popen-gw0\\test_scie_busy...a\\Local\\Temp\\pytest-of-runneradmin\\pytest-0\\popen-gw0\\test_scie_busybox_console_script_inject_python_args_VENV_')
❌ test_scie_busybox_console_script_inject_env[VENV]
tmpdir = Tempdir(path='C:\\Users\\runneradmin\\AppData\\Local\\Temp\\pytest-of-runneradmin\\pytest-0\\popen-gw1\\test_scie_busy...\\AppData\\Local\\Temp\\pytest-of-runneradmin\\pytest-0\\popen-gw1\\test_scie_busybox_console_script_inject_env_VENV_')
❌ test_basic[ZIPAPP-sh-boot-loose-eager]
tmpdir = Tempdir(path='C:\\Users\\runneradmin\\AppData\\Local\\Temp\\pytest-of-runneradmin\\pytest-0\\popen-gw1\\test_basic_ZIP...runneradmin\\AppData\\Local\\Temp\\pytest-of-runneradmin\\pytest-0\\popen-gw1\\test_basic_ZIPAPP_sh_boot_loose_eager_')
❌ test_basic[ZIPAPP-zipapp-lazy]
tmpdir = Tempdir(path='C:\\Users\\runneradmin\\AppData\\Local\\Temp\\pytest-of-runneradmin\\pytest-0\\popen-gw1\\test_basic_ZIPAPP_zipapp_lazy_0', symlink=None)
tests.integration.test_excludes
❌ test_exclude_deep[24.3-resolvelib]
tmpdir = Tempdir(path='C:\\Users\\runneradmin\\AppData\\Local\\Temp\\pytest-of-runneradmin\\pytest-0\\popen-gw0\\test_exclude_d...rs\\runneradmin\\AppData\\Local\\Temp\\pytest-of-runneradmin\\pytest-0\\popen-gw0\\test_exclude_deep_24_3_resolvelib_')
❌ test_exclude_deep[24.1.2-resolvelib]
tmpdir = Tempdir(path='C:\\Users\\runneradmin\\AppData\\Local\\Temp\\pytest-of-runneradmin\\pytest-0\\popen-gw0\\test_exclude_d...\\runneradmin\\AppData\\Local\\Temp\\pytest-of-runneradmin\\pytest-0\\popen-gw0\\test_exclude_deep_24_1_2_resolvelib_')
❌ test_exclude_deep[24.3.1-resolvelib]
tmpdir = Tempdir(path='C:\\Users\\runneradmin\\AppData\\Local\\Temp\\pytest-of-runneradmin\\pytest-0\\popen-gw0\\test_exclude_d...\\runneradmin\\AppData\\Local\\Temp\\pytest-of-runneradmin\\pytest-0\\popen-gw0\\test_exclude_deep_24_3_1_resolvelib_')
❌ test_exclude_deep[25.0.1-resolvelib]
tmpdir = Tempdir(path='C:\\Users\\runneradmin\\AppData\\Local\\Temp\\pytest-of-runneradmin\\pytest-0\\popen-gw0\\test_exclude_d...\\runneradmin\\AppData\\Local\\Temp\\pytest-of-runneradmin\\pytest-0\\popen-gw0\\test_exclude_deep_25_0_1_resolvelib_')
tests.integration.test_issue_1225
❌ test_venv_mode_pex_path
Report exceeded GitHub limit of 65535 bytes and has been trimmed
Annotations
Check failure on line 0 in dist/test-results/integration-1.xml
github-actions / Windows Test Results
pytest ► tests.integration.test_issue_2073
Failed test found in:
dist/test-results/integration-1.xml
Error:
pex\pip\installation.py:262: in bootstrap_pip
Raw output
pex\pip\installation.py:262: in bootstrap_pip
venv.interpreter.execute(args=wheels_cmd)
pex\interpreter.py:1595: in execute
stdout, stderr = Executor.execute(cmd, stdin_payload=stdin_payload, env=env, **kwargs)
pex\executor.py:99: in execute
raise cls.NonZeroExit(cmd, process.returncode, stdout, stderr)
E pex.executor.Executor.NonZeroExit: received exit code 1 during execution of `['C:\\Users\\runneradmin\\AppData\\Local\\Temp\\tmpxeveqqvk\\pip\\Scripts\\python.exe', '-s', '-E', '-m', 'pip', 'wheel', '--wheel-dir', 'C:\\Users\\RUNNER~1\\AppData\\Local\\Temp\\tmpxeveqqvk\\wheels', 'pip==25.0', 'setuptools==75.3.0', 'wheel==0.45.1']` while trying to execute `['C:\\Users\\runneradmin\\AppData\\Local\\Temp\\tmpxeveqqvk\\pip\\Scripts\\python.exe', '-s', '-E', '-m', 'pip', 'wheel', '--wheel-dir', 'C:\\Users\\RUNNER~1\\AppData\\Local\\Temp\\tmpxeveqqvk\\wheels', 'pip==25.0', 'setuptools==75.3.0', 'wheel==0.45.1']`
During handling of the above exception, another exception occurred:
tests\integration\test_issue_2073.py:21: in <module>
abbreviated_platforms.create(FOREIGN_PLATFORM_311)
pex\resolve\abbreviated_platforms.py:156: in create
for tag in _calculate_tags(
pex\resolve\abbreviated_platforms.py:59: in _calculate_tags
pip = get_pip(
pex\pip\installation.py:502: in get_pip
pip = _resolved_installation(
pex\pip\installation.py:300: in _resolved_installation
return _pip_installation(
pex\pip\installation.py:87: in _pip_installation
for dist_location in iter_distribution_locations():
pex\pip\installation.py:264: in bootstrap_pip
raise PipInstallError(
E pex.pip.installation.PipInstallError: Failed to bootstrap Pip 25.0.
E Failed to download its dependencies: received exit code 1 during execution of `['C:\\Users\\runneradmin\\AppData\\Local\\Temp\\tmpxeveqqvk\\pip\\Scripts\\python.exe', '-s', '-E', '-m', 'pip', 'wheel', '--wheel-dir', 'C:\\Users\\RUNNER~1\\AppData\\Local\\Temp\\tmpxeveqqvk\\wheels', 'pip==25.0', 'setuptools==75.3.0', 'wheel==0.45.1']` while trying to execute `['C:\\Users\\runneradmin\\AppData\\Local\\Temp\\tmpxeveqqvk\\pip\\Scripts\\python.exe', '-s', '-E', '-m', 'pip', 'wheel', '--wheel-dir', 'C:\\Users\\RUNNER~1\\AppData\\Local\\Temp\\tmpxeveqqvk\\wheels', 'pip==25.0', 'setuptools==75.3.0', 'wheel==0.45.1']`
Check failure on line 0 in dist/test-results/integration-1.xml
github-actions / Windows Test Results
pytest ► tests.integration.test_issue_157 ► test_empty_pex_no_args[NO_COLOR-scie-ZIPAPP]
Failed test found in:
dist/test-results/integration-1.xml
Error:
tmpdir = Tempdir(path='C:\\Users\\runneradmin\\AppData\\Local\\Temp\\pytest-of-runneradmin\\pytest-0\\popen-gw1\\test_empty_pex...admin\\AppData\\Local\\Temp\\pytest-of-runneradmin\\pytest-0\\popen-gw1\\test_empty_pex_no_args_NO_COLOR_scie_ZIPAPP_')
Raw output
tmpdir = Tempdir(path='C:\\Users\\runneradmin\\AppData\\Local\\Temp\\pytest-of-runneradmin\\pytest-0\\popen-gw1\\test_empty_pex...admin\\AppData\\Local\\Temp\\pytest-of-runneradmin\\pytest-0\\popen-gw1\\test_empty_pex_no_args_NO_COLOR_scie_ZIPAPP_')
pexpect_timeout = 10, execution_mode_args = [], scie_args = ['--scie', 'eager']
color_config = ColorConfig(_env={'NO_COLOR': '1'}, _is_color=False)
@execution_mode_args
@pytest.mark.parametrize(
"scie_args",
[pytest.param([], id="traditional")]
+ ([pytest.param(["--scie", "eager"], id="scie")] if scie.has_provider() else []),
)
@pytest.mark.parametrize(
"color_config",
[
pytest.param(ColorConfig.create(is_color=True), id="IS_TTY"),
pytest.param(ColorConfig.create(is_color=False, NO_COLOR="1"), id="NO_COLOR"),
pytest.param(ColorConfig.create(is_color=False, TERM="dumb"), id="TERM=dumb"),
pytest.param(
ColorConfig.create(is_color=True, FORCE_COLOR="1", TERM="dumb"), id="FORCE_COLOR"
),
],
)
def test_empty_pex_no_args(
tmpdir, # type: Any
pexpect_timeout, # type: int
execution_mode_args, # type: List[str]
scie_args, # type: List[str]
color_config, # type:ColorConfig
):
# type: (...) -> None
> pex = create_pex(tmpdir, extra_args=execution_mode_args + scie_args)
tests\integration\test_issue_157.py:201:
_ _ _ _ _ _ _ _ _ _ _ _ _ _ _ _ _ _ _ _ _ _ _ _ _ _ _ _ _ _ _ _ _ _ _ _ _ _ _ _
tests\integration\test_issue_157.py:99: in create_pex
).assert_success()
_ _ _ _ _ _ _ _ _ _ _ _ _ _ _ _ _ _ _ _ _ _ _ _ _ _ _ _ _ _ _ _ _ _ _ _ _ _ _ _
self = IntegResults(output='', error='pex: Hashing pex\r\npex: Hashing pex: 66.4ms\r\npex: Isolating pex\r\npex: Isolating pe...: path is on mount \'C:\', start on mount \'D:\'\r\npath is on mount \'C:\', start on mount \'D:\'\r\n', return_code=1)
expected_output_re = None, expected_error_re = None, re_flags = 0
def assert_success(
self,
expected_output_re=None, # type: Optional[str]
expected_error_re=None, # type: Optional[str]
re_flags=0, # type: int
):
# type: (...) -> None
assert (
> self.return_code == 0
), "integration test failed: return_code={}, output={}, error={}".format(
self.return_code, self.output, self.error
)
E AssertionError: integration test failed: return_code=1, output=, error=pex: Hashing pex
E pex: Hashing pex: 66.4ms
E pex: Isolating pex
E pex: Isolating pex :: Extracting pex to C:\Users\runneradmin\AppData\Local\Temp\pytest-of-runneradmin\pytest-0\popen-gw1\test_empty_pex_no_args_N-9e5f70\pex_root\isolated\0\ccda5fa6a65e7b7e351b6142bd40510afb08a216
E pex: Isolating pex: 3841.6ms
E pex: Extracting pex to C:\Users\runneradmin\AppData\Local\Temp\pytest-of-runneradmin\pytest-0\popen-gw1\test_empty_pex_no_args_N-9e5f70\pex_root\isolated\0\ccda5fa6a65e7b7e351b6142bd40510afb08a216: 3839.5ms
E pex: Building pex
E pex: Building pex :: Adding distributions from pexes:
E pex: Building pex :: Adding distributions built from local projects and collecting their requirements:
E pex: Building pex :: Adding distributions built from local projects and collecting their requirements: :: Resolving requirements.
E pex: Building pex :: Resolving distributions for requirements:
E pex: Building pex :: Resolving distributions for requirements: :: Resolving requirements.
E pex: Building pex :: Configuring PEX dependencies
E pex: Building pex: 1.8ms
E pex: Adding distributions from pexes: : 0.0ms
E pex: Adding distributions built from local projects and collecting their requirements: : 0.4ms
E pex: Resolving requirements.: 0.3ms
E pex: Resolving distributions for requirements: : 0.4ms
E pex: Resolving requirements.: 0.3ms
E pex: Configuring PEX dependencies: 0.1ms
E Saving PEX file to C:\Users\runneradmin\AppData\Local\Temp\pytest-of-runneradmin\pytest-0\popen-gw1\test_empty_pex_no_args_N-9e5f70\pex
E pex: Zipping PEX file.
E pex: Zipping PEX file.: 153.5ms
E pex: Building scie(s)
E pex: Fetching science binary from https://github.com/a-scie/lift/releases/download/v0.10.1/science-fat-windows-x86_64.exe...
E pex: Building scie(s): 18364.3ms
E Traceback (most recent call last):
E File "D:\a\pex\pex\repo\pex\result.py", line 105, in catch
E return func(*args, **kwargs)
E File "D:\a\pex\pex\repo\pex\bin\pex.py", line 1383, in do_main
E scie=os.path.relpath(scie_info.file),
E ~~~~~~~~~~~~~~~^^^^^^^^^^^^^^^^
E File "<frozen ntpath>", line 796, in relpath
E ValueError: path is on mount 'C:', start on mount 'D:'
E path is on mount 'C:', start on mount 'D:'
testing\__init__.py:407: AssertionError
Check failure on line 0 in dist/test-results/integration-1.xml
github-actions / Windows Test Results
pytest ► tests.integration.test_issue_157 ► test_empty_pex_no_args[NO_COLOR-scie-VENV]
Failed test found in:
dist/test-results/integration-1.xml
Error:
tmpdir = Tempdir(path='C:\\Users\\runneradmin\\AppData\\Local\\Temp\\pytest-of-runneradmin\\pytest-0\\popen-gw1\\test_empty_pex...eradmin\\AppData\\Local\\Temp\\pytest-of-runneradmin\\pytest-0\\popen-gw1\\test_empty_pex_no_args_NO_COLOR_scie_VENV_')
Raw output
tmpdir = Tempdir(path='C:\\Users\\runneradmin\\AppData\\Local\\Temp\\pytest-of-runneradmin\\pytest-0\\popen-gw1\\test_empty_pex...eradmin\\AppData\\Local\\Temp\\pytest-of-runneradmin\\pytest-0\\popen-gw1\\test_empty_pex_no_args_NO_COLOR_scie_VENV_')
pexpect_timeout = 10, execution_mode_args = ['--venv']
scie_args = ['--scie', 'eager']
color_config = ColorConfig(_env={'NO_COLOR': '1'}, _is_color=False)
@execution_mode_args
@pytest.mark.parametrize(
"scie_args",
[pytest.param([], id="traditional")]
+ ([pytest.param(["--scie", "eager"], id="scie")] if scie.has_provider() else []),
)
@pytest.mark.parametrize(
"color_config",
[
pytest.param(ColorConfig.create(is_color=True), id="IS_TTY"),
pytest.param(ColorConfig.create(is_color=False, NO_COLOR="1"), id="NO_COLOR"),
pytest.param(ColorConfig.create(is_color=False, TERM="dumb"), id="TERM=dumb"),
pytest.param(
ColorConfig.create(is_color=True, FORCE_COLOR="1", TERM="dumb"), id="FORCE_COLOR"
),
],
)
def test_empty_pex_no_args(
tmpdir, # type: Any
pexpect_timeout, # type: int
execution_mode_args, # type: List[str]
scie_args, # type: List[str]
color_config, # type:ColorConfig
):
# type: (...) -> None
> pex = create_pex(tmpdir, extra_args=execution_mode_args + scie_args)
tests\integration\test_issue_157.py:201:
_ _ _ _ _ _ _ _ _ _ _ _ _ _ _ _ _ _ _ _ _ _ _ _ _ _ _ _ _ _ _ _ _ _ _ _ _ _ _ _
tests\integration\test_issue_157.py:99: in create_pex
).assert_success()
_ _ _ _ _ _ _ _ _ _ _ _ _ _ _ _ _ _ _ _ _ _ _ _ _ _ _ _ _ _ _ _ _ _ _ _ _ _ _ _
self = IntegResults(output='', error='pex: Hashing pex\r\npex: Hashing pex: 58.7ms\r\npex: Isolating pex\r\npex: Isolating pe...: path is on mount \'C:\', start on mount \'D:\'\r\npath is on mount \'C:\', start on mount \'D:\'\r\n', return_code=1)
expected_output_re = None, expected_error_re = None, re_flags = 0
def assert_success(
self,
expected_output_re=None, # type: Optional[str]
expected_error_re=None, # type: Optional[str]
re_flags=0, # type: int
):
# type: (...) -> None
assert (
> self.return_code == 0
), "integration test failed: return_code={}, output={}, error={}".format(
self.return_code, self.output, self.error
)
E AssertionError: integration test failed: return_code=1, output=, error=pex: Hashing pex
E pex: Hashing pex: 58.7ms
E pex: Isolating pex
E pex: Isolating pex :: Extracting pex to C:\Users\runneradmin\AppData\Local\Temp\pytest-of-runneradmin\pytest-0\popen-gw1\test_empty_pex_no_args_N-d10090\pex_root\isolated\0\ccda5fa6a65e7b7e351b6142bd40510afb08a216
E pex: Isolating pex: 1547.1ms
E pex: Extracting pex to C:\Users\runneradmin\AppData\Local\Temp\pytest-of-runneradmin\pytest-0\popen-gw1\test_empty_pex_no_args_N-d10090\pex_root\isolated\0\ccda5fa6a65e7b7e351b6142bd40510afb08a216: 1544.9ms
E pex: Building pex
E pex: Building pex :: Adding distributions from pexes:
E pex: Building pex :: Adding distributions built from local projects and collecting their requirements:
E pex: Building pex :: Adding distributions built from local projects and collecting their requirements: :: Resolving requirements.
E pex: Building pex :: Resolving distributions for requirements:
E pex: Building pex :: Resolving distributions for requirements: :: Resolving requirements.
E pex: Building pex :: Configuring PEX dependencies
E pex: Building pex: 1.9ms
E pex: Adding distributions from pexes: : 0.0ms
E pex: Adding distributions built from local projects and collecting their requirements: : 0.4ms
E pex: Resolving requirements.: 0.3ms
E pex: Resolving distributions for requirements: : 0.3ms
E pex: Resolving requirements.: 0.3ms
E pex: Configuring PEX dependencies: 0.1ms
E Saving PEX file to C:\Users\runneradmin\AppData\Local\Temp\pytest-of-runneradmin\pytest-0\popen-gw1\test_empty_pex_no_args_N-d10090\pex
E pex: Zipping PEX file.
E pex: Zipping PEX file.: 151.5ms
E pex: Building scie(s)
E pex: Fetching science binary from https://github.com/a-scie/lift/releases/download/v0.10.1/science-fat-windows-x86_64.exe...
E pex: Building scie(s): 4083.8ms
E Traceback (most recent call last):
E File "D:\a\pex\pex\repo\pex\result.py", line 105, in catch
E return func(*args, **kwargs)
E File "D:\a\pex\pex\repo\pex\bin\pex.py", line 1383, in do_main
E scie=os.path.relpath(scie_info.file),
E ~~~~~~~~~~~~~~~^^^^^^^^^^^^^^^^
E File "<frozen ntpath>", line 796, in relpath
E ValueError: path is on mount 'C:', start on mount 'D:'
E path is on mount 'C:', start on mount 'D:'
testing\__init__.py:407: AssertionError
Check failure on line 0 in dist/test-results/integration-1.xml
github-actions / Windows Test Results
pytest ► tests.integration.test_issue_157 ► test_pex_cli_no_args[VENV]
Failed test found in:
dist/test-results/integration-1.xml
Error:
tmpdir = Tempdir(path='C:\\Users\\runneradmin\\AppData\\Local\\Temp\\pytest-of-runneradmin\\pytest-0\\popen-gw0\\test_pex_cli_no_args_VENV_0', symlink=None)
Raw output
tmpdir = Tempdir(path='C:\\Users\\runneradmin\\AppData\\Local\\Temp\\pytest-of-runneradmin\\pytest-0\\popen-gw0\\test_pex_cli_no_args_VENV_0', symlink=None)
pexpect_timeout = 10, execution_mode_args = ['--venv']
pex_project_dir = 'D:/a/pex/pex/repo'
@execution_mode_args
def test_pex_cli_no_args(
tmpdir, # type: Any
pexpect_timeout, # type: int
execution_mode_args, # type: List[str]
pex_project_dir, # type: str
):
# type: (...) -> None
> pex = create_pex(tmpdir, extra_args=[pex_project_dir, "-c", "pex"] + execution_mode_args)
tests\integration\test_issue_157.py:222:
_ _ _ _ _ _ _ _ _ _ _ _ _ _ _ _ _ _ _ _ _ _ _ _ _ _ _ _ _ _ _ _ _ _ _ _ _ _ _ _
tests\integration\test_issue_157.py:99: in create_pex
).assert_success()
_ _ _ _ _ _ _ _ _ _ _ _ _ _ _ _ _ _ _ _ _ _ _ _ _ _ _ _ _ _ _ _ _ _ _ _ _ _ _ _
self = IntegResults(output='', error="pex: Hashing pex\r\npex: Hashing pex: 61.9ms\r\npex: Isolating pex\r\npex: Isolating pe...erpreter at D:\\a\\pex\\pex\\repo\\.tox\\py313-pip25_0-integration\\Scripts\\python.exe: 13120.4ms\r\n", return_code=1)
expected_output_re = None, expected_error_re = None, re_flags = 0
def assert_success(
self,
expected_output_re=None, # type: Optional[str]
expected_error_re=None, # type: Optional[str]
re_flags=0, # type: int
):
# type: (...) -> None
assert (
> self.return_code == 0
), "integration test failed: return_code={}, output={}, error={}".format(
self.return_code, self.output, self.error
)
E AssertionError: integration test failed: return_code=1, output=, error=pex: Hashing pex
E pex: Hashing pex: 61.9ms
E pex: Isolating pex
E pex: Isolating pex :: Extracting pex to C:\Users\runneradmin\AppData\Local\Temp\pytest-of-runneradmin\pytest-0\popen-gw0\test_pex_cli_no_args_VENV_0\pex_root\isolated\0\ccda5fa6a65e7b7e351b6142bd40510afb08a216
E pex: Isolating pex: 1712.8ms
E pex: Extracting pex to C:\Users\runneradmin\AppData\Local\Temp\pytest-of-runneradmin\pytest-0\popen-gw0\test_pex_cli_no_args_VENV_0\pex_root\isolated\0\ccda5fa6a65e7b7e351b6142bd40510afb08a216: 1710.5ms
E pex: Building pex
E pex: Building pex :: Adding distributions from pexes:
E pex: Building pex :: Adding distributions built from local projects and collecting their requirements:
E pex: Building pex :: Adding distributions built from local projects and collecting their requirements: :: Resolving requirements.
E pex: Building pex :: Resolving distributions for requirements: D:/a/pex/pex/repo
E pex: Building pex :: Resolving distributions for requirements: D:/a/pex/pex/repo :: Resolving requirements.
E pex: Building pex :: Resolving distributions for requirements: D:/a/pex/pex/repo :: Resolving requirements. :: Resolving for:
E cp313-cp313-win_amd64 interpreter at D:\a\pex\pex\repo\.tox\py313-pip25_0-integration\Scripts\python.exe
E Failed to spawn a job for D:\a\pex\pex\repo\.tox\py313-pip25_0-integration\Scripts\python.exe: Failed to bootstrap Pip 25.0.
E Failed to download its dependencies: received exit code 1 during execution of `['C:\\Users\\runneradmin\\AppData\\Local\\Temp\\tmp_mlp44ij\\pip\\Scripts\\python.exe', '-s', '-E', '-m', 'pip', 'wheel', '--wheel-dir', 'C:\\Users\\runneradmin\\AppData\\Local\\Temp\\tmp_mlp44ij\\wheels', 'pip==25.0', 'setuptools==75.3.0', 'wheel==0.45.1']` while trying to execute `['C:\\Users\\runneradmin\\AppData\\Local\\Temp\\tmp_mlp44ij\\pip\\Scripts\\python.exe', '-s', '-E', '-m', 'pip', 'wheel', '--wheel-dir', 'C:\\Users\\runneradmin\\AppData\\Local\\Temp\\tmp_mlp44ij\\wheels', 'pip==25.0', 'setuptools==75.3.0', 'wheel==0.45.1']`
E pex: Building pex: 13741.6ms
E pex: Adding distributions from pexes: : 0.0ms
E pex: Adding distributions built from local projects and collecting their requirements: : 0.5ms
E pex: Resolving requirements.: 0.4ms
E pex: Resolving distributions for requirements: D:/a/pex/pex/repo: 13740.1ms
E pex: Resolving requirements.: 13740.0ms
E pex: Resolving for:
E cp313-cp313-win_amd64 interpreter at D:\a\pex\pex\repo\.tox\py313-pip25_0-integration\Scripts\python.exe: 13120.4ms
testing\__init__.py:407: AssertionError
Check failure on line 0 in dist/test-results/integration-1.xml
github-actions / Windows Test Results
pytest ► tests.integration.test_issue_157 ► test_empty_pex_no_args[FORCE_COLOR-scie-VENV]
Failed test found in:
dist/test-results/integration-1.xml
Error:
tmpdir = Tempdir(path='C:\\Users\\runneradmin\\AppData\\Local\\Temp\\pytest-of-runneradmin\\pytest-0\\popen-gw0\\test_empty_pex...dmin\\AppData\\Local\\Temp\\pytest-of-runneradmin\\pytest-0\\popen-gw0\\test_empty_pex_no_args_FORCE_COLOR_scie_VENV_')
Raw output
tmpdir = Tempdir(path='C:\\Users\\runneradmin\\AppData\\Local\\Temp\\pytest-of-runneradmin\\pytest-0\\popen-gw0\\test_empty_pex...dmin\\AppData\\Local\\Temp\\pytest-of-runneradmin\\pytest-0\\popen-gw0\\test_empty_pex_no_args_FORCE_COLOR_scie_VENV_')
pexpect_timeout = 10, execution_mode_args = ['--venv']
scie_args = ['--scie', 'eager']
color_config = ColorConfig(_env={'FORCE_COLOR': '1', 'TERM': 'dumb'}, _is_color=True)
@execution_mode_args
@pytest.mark.parametrize(
"scie_args",
[pytest.param([], id="traditional")]
+ ([pytest.param(["--scie", "eager"], id="scie")] if scie.has_provider() else []),
)
@pytest.mark.parametrize(
"color_config",
[
pytest.param(ColorConfig.create(is_color=True), id="IS_TTY"),
pytest.param(ColorConfig.create(is_color=False, NO_COLOR="1"), id="NO_COLOR"),
pytest.param(ColorConfig.create(is_color=False, TERM="dumb"), id="TERM=dumb"),
pytest.param(
ColorConfig.create(is_color=True, FORCE_COLOR="1", TERM="dumb"), id="FORCE_COLOR"
),
],
)
def test_empty_pex_no_args(
tmpdir, # type: Any
pexpect_timeout, # type: int
execution_mode_args, # type: List[str]
scie_args, # type: List[str]
color_config, # type:ColorConfig
):
# type: (...) -> None
> pex = create_pex(tmpdir, extra_args=execution_mode_args + scie_args)
tests\integration\test_issue_157.py:201:
_ _ _ _ _ _ _ _ _ _ _ _ _ _ _ _ _ _ _ _ _ _ _ _ _ _ _ _ _ _ _ _ _ _ _ _ _ _ _ _
tests\integration\test_issue_157.py:99: in create_pex
).assert_success()
_ _ _ _ _ _ _ _ _ _ _ _ _ _ _ _ _ _ _ _ _ _ _ _ _ _ _ _ _ _ _ _ _ _ _ _ _ _ _ _
self = IntegResults(output='', error='pex: Hashing pex\r\npex: Hashing pex: 58.0ms\r\npex: Isolating pex\r\npex: Isolating pe...: path is on mount \'C:\', start on mount \'D:\'\r\npath is on mount \'C:\', start on mount \'D:\'\r\n', return_code=1)
expected_output_re = None, expected_error_re = None, re_flags = 0
def assert_success(
self,
expected_output_re=None, # type: Optional[str]
expected_error_re=None, # type: Optional[str]
re_flags=0, # type: int
):
# type: (...) -> None
assert (
> self.return_code == 0
), "integration test failed: return_code={}, output={}, error={}".format(
self.return_code, self.output, self.error
)
E AssertionError: integration test failed: return_code=1, output=, error=pex: Hashing pex
E pex: Hashing pex: 58.0ms
E pex: Isolating pex
E pex: Isolating pex :: Extracting pex to C:\Users\runneradmin\AppData\Local\Temp\pytest-of-runneradmin\pytest-0\popen-gw0\test_empty_pex_no_args_F-05c600\pex_root\isolated\0\ccda5fa6a65e7b7e351b6142bd40510afb08a216
E pex: Isolating pex: 3289.8ms
E pex: Extracting pex to C:\Users\runneradmin\AppData\Local\Temp\pytest-of-runneradmin\pytest-0\popen-gw0\test_empty_pex_no_args_F-05c600\pex_root\isolated\0\ccda5fa6a65e7b7e351b6142bd40510afb08a216: 3287.8ms
E pex: Building pex
E pex: Building pex :: Adding distributions from pexes:
E pex: Building pex :: Adding distributions built from local projects and collecting their requirements:
E pex: Building pex :: Adding distributions built from local projects and collecting their requirements: :: Resolving requirements.
E pex: Building pex :: Resolving distributions for requirements:
E pex: Building pex :: Resolving distributions for requirements: :: Resolving requirements.
E pex: Building pex :: Configuring PEX dependencies
E pex: Building pex: 1.7ms
E pex: Adding distributions from pexes: : 0.0ms
E pex: Adding distributions built from local projects and collecting their requirements: : 0.4ms
E pex: Resolving requirements.: 0.3ms
E pex: Resolving distributions for requirements: : 0.3ms
E pex: Resolving requirements.: 0.3ms
E pex: Configuring PEX dependencies: 0.0ms
E Saving PEX file to C:\Users\runneradmin\AppData\Local\Temp\pytest-of-runneradmin\pytest-0\popen-gw0\test_empty_pex_no_args_F-05c600\pex
E pex: Zipping PEX file.
E pex: Zipping PEX file.: 154.3ms
E pex: Building scie(s)
E pex: Fetching science binary from https://github.com/a-scie/lift/releases/download/v0.10.1/science-fat-windows-x86_64.exe...
E pex: Building scie(s): 4495.1ms
E Traceback (most recent call last):
E File "D:\a\pex\pex\repo\pex\result.py", line 105, in catch
E return func(*args, **kwargs)
E File "D:\a\pex\pex\repo\pex\bin\pex.py", line 1383, in do_main
E scie=os.path.relpath(scie_info.file),
E ~~~~~~~~~~~~~~~^^^^^^^^^^^^^^^^
E File "<frozen ntpath>", line 796, in relpath
E ValueError: path is on mount 'C:', start on mount 'D:'
E path is on mount 'C:', start on mount 'D:'
testing\__init__.py:407: AssertionError
Check failure on line 0 in dist/test-results/integration-1.xml
github-actions / Windows Test Results
pytest ► tests.integration.test_issue_157 ► test_pex_info_command_packed_pex_directory
Failed test found in:
dist/test-results/integration-1.xml
Error:
tmpdir = Tempdir(path='C:\\Users\\runneradmin\\AppData\\Local\\Temp\\pytest-of-runneradmin\\pytest-0\\popen-gw0\\test_pex_info_...eradmin\\AppData\\Local\\Temp\\pytest-of-runneradmin\\pytest-0\\popen-gw0\\test_pex_info_command_packed_pex_directory')
Raw output
tmpdir = Tempdir(path='C:\\Users\\runneradmin\\AppData\\Local\\Temp\\pytest-of-runneradmin\\pytest-0\\popen-gw0\\test_pex_info_...eradmin\\AppData\\Local\\Temp\\pytest-of-runneradmin\\pytest-0\\popen-gw0\\test_pex_info_command_packed_pex_directory')
pexpect_timeout = 10
def test_pex_info_command_packed_pex_directory(
tmpdir, # type: Any
pexpect_timeout, # type: int
):
# type: (...) -> None
pex = create_pex(tmpdir, extra_args=["--layout", "packed"])
> with expect_pex_info_response(tmpdir, pex, pexpect_timeout) as process:
tests\integration\test_issue_157.py:296:
_ _ _ _ _ _ _ _ _ _ _ _ _ _ _ _ _ _ _ _ _ _ _ _ _ _ _ _ _ _ _ _ _ _ _ _ _ _ _ _
C:\hostedtoolcache\windows\Python\3.13.2\x64\Lib\contextlib.py:141: in __enter__
return next(self.gen)
tests\integration\test_issue_157.py:271: in expect_pex_info_response
with pexpect_spawn(tmpdir, pex) as process:
C:\hostedtoolcache\windows\Python\3.13.2\x64\Lib\contextlib.py:141: in __enter__
return next(self.gen)
_ _ _ _ _ _ _ _ _ _ _ _ _ _ _ _ _ _ _ _ _ _ _ _ _ _ _ _ _ _ _ _ _ _ _ _ _ _ _ _
tmpdir = Tempdir(path='C:\\Users\\runneradmin\\AppData\\Local\\Temp\\pytest-of-runneradmin\\pytest-0\\popen-gw0\\test_pex_info_...eradmin\\AppData\\Local\\Temp\\pytest-of-runneradmin\\pytest-0\\popen-gw0\\test_pex_info_command_packed_pex_directory')
pex = Pex(path='C:\\Users\\runneradmin\\AppData\\Local\\Temp\\pytest-of-runneradmin\\pytest-0\\popen-gw0\\test_pex_info_comm...ted_python_banner_lines=('3.13.2 (tags/v3.13.2:4f8bb39, Feb 4 2025, 15:23:48) [MSC v.1942 64 bit (AMD64)] on win32',))
kwargs = {'dimensions': (24, 80), 'logfile': <_io.BufferedWriter name='C:\\Users\\runneradmin\\AppData\\Local\\Temp\\pytest-of-runneradmin\\pytest-0\\popen-gw0\\test_pex_info_command_pa-3c3030\\pexpect.log'>}
log = <_io.BufferedWriter name='C:\\Users\\runneradmin\\AppData\\Local\\Temp\\pytest-of-runneradmin\\pytest-0\\popen-gw0\\test_pex_info_command_pa-3c3030\\pexpect.log'>
@contextmanager
def pexpect_spawn(
tmpdir, # type: Any
pex, # type: Pex
**kwargs # type: Any
):
# type: (...) -> Iterator[pexpect.spawn]
with open(os.path.join(str(tmpdir), "pexpect.log"), "wb") as log:
kwargs.update(dimensions=(24, 80), logfile=log)
with closing(
> pexpect.spawn(
os.path.join(pex.path, "__main__.py") if os.path.isdir(pex.path) else pex.path,
**kwargs
)
) as process:
E AttributeError: module 'pexpect' has no attribute 'spawn'
tests\integration\test_issue_157.py:146: AttributeError
Check failure on line 0 in dist/test-results/integration-1.xml
github-actions / Windows Test Results
pytest ► tests.integration.test_issue_157 ► test_empty_pex_no_args[IS_TTY-traditional-ZIPAPP]
Failed test found in:
dist/test-results/integration-1.xml
Error:
tmpdir = Tempdir(path='C:\\Users\\runneradmin\\AppData\\Local\\Temp\\pytest-of-runneradmin\\pytest-0\\popen-gw0\\test_empty_pex...\\AppData\\Local\\Temp\\pytest-of-runneradmin\\pytest-0\\popen-gw0\\test_empty_pex_no_args_IS_TTY_traditional_ZIPAPP_')
Raw output
tmpdir = Tempdir(path='C:\\Users\\runneradmin\\AppData\\Local\\Temp\\pytest-of-runneradmin\\pytest-0\\popen-gw0\\test_empty_pex...\\AppData\\Local\\Temp\\pytest-of-runneradmin\\pytest-0\\popen-gw0\\test_empty_pex_no_args_IS_TTY_traditional_ZIPAPP_')
pexpect_timeout = 10, execution_mode_args = [], scie_args = []
color_config = ColorConfig(_env={}, _is_color=True)
@execution_mode_args
@pytest.mark.parametrize(
"scie_args",
[pytest.param([], id="traditional")]
+ ([pytest.param(["--scie", "eager"], id="scie")] if scie.has_provider() else []),
)
@pytest.mark.parametrize(
"color_config",
[
pytest.param(ColorConfig.create(is_color=True), id="IS_TTY"),
pytest.param(ColorConfig.create(is_color=False, NO_COLOR="1"), id="NO_COLOR"),
pytest.param(ColorConfig.create(is_color=False, TERM="dumb"), id="TERM=dumb"),
pytest.param(
ColorConfig.create(is_color=True, FORCE_COLOR="1", TERM="dumb"), id="FORCE_COLOR"
),
],
)
def test_empty_pex_no_args(
tmpdir, # type: Any
pexpect_timeout, # type: int
execution_mode_args, # type: List[str]
scie_args, # type: List[str]
color_config, # type:ColorConfig
):
# type: (...) -> None
pex = create_pex(tmpdir, extra_args=execution_mode_args + scie_args)
> with color_config.env() as expect_color, pexpect_spawn(tmpdir, pex) as process:
tests\integration\test_issue_157.py:202:
_ _ _ _ _ _ _ _ _ _ _ _ _ _ _ _ _ _ _ _ _ _ _ _ _ _ _ _ _ _ _ _ _ _ _ _ _ _ _ _
C:\hostedtoolcache\windows\Python\3.13.2\x64\Lib\contextlib.py:141: in __enter__
return next(self.gen)
_ _ _ _ _ _ _ _ _ _ _ _ _ _ _ _ _ _ _ _ _ _ _ _ _ _ _ _ _ _ _ _ _ _ _ _ _ _ _ _
tmpdir = Tempdir(path='C:\\Users\\runneradmin\\AppData\\Local\\Temp\\pytest-of-runneradmin\\pytest-0\\popen-gw0\\test_empty_pex...\\AppData\\Local\\Temp\\pytest-of-runneradmin\\pytest-0\\popen-gw0\\test_empty_pex_no_args_IS_TTY_traditional_ZIPAPP_')
pex = Pex(path='C:\\Users\\runneradmin\\AppData\\Local\\Temp\\pytest-of-runneradmin\\pytest-0\\popen-gw0\\test_empty_pex_no_...ted_python_banner_lines=('3.13.2 (tags/v3.13.2:4f8bb39, Feb 4 2025, 15:23:48) [MSC v.1942 64 bit (AMD64)] on win32',))
kwargs = {'dimensions': (24, 80), 'logfile': <_io.BufferedWriter name='C:\\Users\\runneradmin\\AppData\\Local\\Temp\\pytest-of-runneradmin\\pytest-0\\popen-gw0\\test_empty_pex_no_args_I-4e6290\\pexpect.log'>}
log = <_io.BufferedWriter name='C:\\Users\\runneradmin\\AppData\\Local\\Temp\\pytest-of-runneradmin\\pytest-0\\popen-gw0\\test_empty_pex_no_args_I-4e6290\\pexpect.log'>
@contextmanager
def pexpect_spawn(
tmpdir, # type: Any
pex, # type: Pex
**kwargs # type: Any
):
# type: (...) -> Iterator[pexpect.spawn]
with open(os.path.join(str(tmpdir), "pexpect.log"), "wb") as log:
kwargs.update(dimensions=(24, 80), logfile=log)
with closing(
> pexpect.spawn(
os.path.join(pex.path, "__main__.py") if os.path.isdir(pex.path) else pex.path,
**kwargs
)
) as process:
E AttributeError: module 'pexpect' has no attribute 'spawn'
tests\integration\test_issue_157.py:146: AttributeError
Check failure on line 0 in dist/test-results/integration-1.xml
github-actions / Windows Test Results
pytest ► tests.integration.test_issue_157 ► test_empty_pex_no_args[NO_COLOR-traditional-ZIPAPP]
Failed test found in:
dist/test-results/integration-1.xml
Error:
tmpdir = Tempdir(path='C:\\Users\\runneradmin\\AppData\\Local\\Temp\\pytest-of-runneradmin\\pytest-0\\popen-gw0\\test_empty_pex...AppData\\Local\\Temp\\pytest-of-runneradmin\\pytest-0\\popen-gw0\\test_empty_pex_no_args_NO_COLOR_traditional_ZIPAPP_')
Raw output
tmpdir = Tempdir(path='C:\\Users\\runneradmin\\AppData\\Local\\Temp\\pytest-of-runneradmin\\pytest-0\\popen-gw0\\test_empty_pex...AppData\\Local\\Temp\\pytest-of-runneradmin\\pytest-0\\popen-gw0\\test_empty_pex_no_args_NO_COLOR_traditional_ZIPAPP_')
pexpect_timeout = 10, execution_mode_args = [], scie_args = []
color_config = ColorConfig(_env={'NO_COLOR': '1'}, _is_color=False)
@execution_mode_args
@pytest.mark.parametrize(
"scie_args",
[pytest.param([], id="traditional")]
+ ([pytest.param(["--scie", "eager"], id="scie")] if scie.has_provider() else []),
)
@pytest.mark.parametrize(
"color_config",
[
pytest.param(ColorConfig.create(is_color=True), id="IS_TTY"),
pytest.param(ColorConfig.create(is_color=False, NO_COLOR="1"), id="NO_COLOR"),
pytest.param(ColorConfig.create(is_color=False, TERM="dumb"), id="TERM=dumb"),
pytest.param(
ColorConfig.create(is_color=True, FORCE_COLOR="1", TERM="dumb"), id="FORCE_COLOR"
),
],
)
def test_empty_pex_no_args(
tmpdir, # type: Any
pexpect_timeout, # type: int
execution_mode_args, # type: List[str]
scie_args, # type: List[str]
color_config, # type:ColorConfig
):
# type: (...) -> None
pex = create_pex(tmpdir, extra_args=execution_mode_args + scie_args)
> with color_config.env() as expect_color, pexpect_spawn(tmpdir, pex) as process:
tests\integration\test_issue_157.py:202:
_ _ _ _ _ _ _ _ _ _ _ _ _ _ _ _ _ _ _ _ _ _ _ _ _ _ _ _ _ _ _ _ _ _ _ _ _ _ _ _
C:\hostedtoolcache\windows\Python\3.13.2\x64\Lib\contextlib.py:141: in __enter__
return next(self.gen)
_ _ _ _ _ _ _ _ _ _ _ _ _ _ _ _ _ _ _ _ _ _ _ _ _ _ _ _ _ _ _ _ _ _ _ _ _ _ _ _
tmpdir = Tempdir(path='C:\\Users\\runneradmin\\AppData\\Local\\Temp\\pytest-of-runneradmin\\pytest-0\\popen-gw0\\test_empty_pex...AppData\\Local\\Temp\\pytest-of-runneradmin\\pytest-0\\popen-gw0\\test_empty_pex_no_args_NO_COLOR_traditional_ZIPAPP_')
pex = Pex(path='C:\\Users\\runneradmin\\AppData\\Local\\Temp\\pytest-of-runneradmin\\pytest-0\\popen-gw0\\test_empty_pex_no_...ted_python_banner_lines=('3.13.2 (tags/v3.13.2:4f8bb39, Feb 4 2025, 15:23:48) [MSC v.1942 64 bit (AMD64)] on win32',))
kwargs = {'dimensions': (24, 80), 'logfile': <_io.BufferedWriter name='C:\\Users\\runneradmin\\AppData\\Local\\Temp\\pytest-of-runneradmin\\pytest-0\\popen-gw0\\test_empty_pex_no_args_N-c3c9a0\\pexpect.log'>}
log = <_io.BufferedWriter name='C:\\Users\\runneradmin\\AppData\\Local\\Temp\\pytest-of-runneradmin\\pytest-0\\popen-gw0\\test_empty_pex_no_args_N-c3c9a0\\pexpect.log'>
@contextmanager
def pexpect_spawn(
tmpdir, # type: Any
pex, # type: Pex
**kwargs # type: Any
):
# type: (...) -> Iterator[pexpect.spawn]
with open(os.path.join(str(tmpdir), "pexpect.log"), "wb") as log:
kwargs.update(dimensions=(24, 80), logfile=log)
with closing(
> pexpect.spawn(
os.path.join(pex.path, "__main__.py") if os.path.isdir(pex.path) else pex.path,
**kwargs
)
) as process:
E AttributeError: module 'pexpect' has no attribute 'spawn'
tests\integration\test_issue_157.py:146: AttributeError
Check failure on line 0 in dist/test-results/integration-1.xml
github-actions / Windows Test Results
pytest ► tests.integration.test_issue_157 ► test_empty_pex_no_args[TERM=dumb-traditional-VENV]
Failed test found in:
dist/test-results/integration-1.xml
Error:
tmpdir = Tempdir(path='C:\\Users\\runneradmin\\AppData\\Local\\Temp\\pytest-of-runneradmin\\pytest-0\\popen-gw1\\test_empty_pex...\AppData\\Local\\Temp\\pytest-of-runneradmin\\pytest-0\\popen-gw1\\test_empty_pex_no_args_TERM_dumb_traditional_VENV_')
Raw output
tmpdir = Tempdir(path='C:\\Users\\runneradmin\\AppData\\Local\\Temp\\pytest-of-runneradmin\\pytest-0\\popen-gw1\\test_empty_pex...\AppData\\Local\\Temp\\pytest-of-runneradmin\\pytest-0\\popen-gw1\\test_empty_pex_no_args_TERM_dumb_traditional_VENV_')
pexpect_timeout = 10, execution_mode_args = ['--venv'], scie_args = []
color_config = ColorConfig(_env={'TERM': 'dumb'}, _is_color=False)
@execution_mode_args
@pytest.mark.parametrize(
"scie_args",
[pytest.param([], id="traditional")]
+ ([pytest.param(["--scie", "eager"], id="scie")] if scie.has_provider() else []),
)
@pytest.mark.parametrize(
"color_config",
[
pytest.param(ColorConfig.create(is_color=True), id="IS_TTY"),
pytest.param(ColorConfig.create(is_color=False, NO_COLOR="1"), id="NO_COLOR"),
pytest.param(ColorConfig.create(is_color=False, TERM="dumb"), id="TERM=dumb"),
pytest.param(
ColorConfig.create(is_color=True, FORCE_COLOR="1", TERM="dumb"), id="FORCE_COLOR"
),
],
)
def test_empty_pex_no_args(
tmpdir, # type: Any
pexpect_timeout, # type: int
execution_mode_args, # type: List[str]
scie_args, # type: List[str]
color_config, # type:ColorConfig
):
# type: (...) -> None
> pex = create_pex(tmpdir, extra_args=execution_mode_args + scie_args)
tests\integration\test_issue_157.py:201:
_ _ _ _ _ _ _ _ _ _ _ _ _ _ _ _ _ _ _ _ _ _ _ _ _ _ _ _ _ _ _ _ _ _ _ _ _ _ _ _
tests\integration\test_issue_157.py:104: in create_pex
subprocess.check_output(
testing\subprocess.py:69: in check_output
return cast(bytes, subprocess.check_output(args=_safe_args(args), **kwargs))
C:\hostedtoolcache\windows\Python\3.13.2\x64\Lib\subprocess.py:474: in check_output
return run(*popenargs, stdout=PIPE, timeout=timeout, check=True,
_ _ _ _ _ _ _ _ _ _ _ _ _ _ _ _ _ _ _ _ _ _ _ _ _ _ _ _ _ _ _ _ _ _ _ _ _ _ _ _
input = None, capture_output = False, timeout = None, check = True
popenargs = ()
kwargs = {'args': ['D:\\a\\pex\\pex\\repo\\.tox\\py313-pip25_0-integration\\Scripts\\python.EXE', 'C:\\Users\\runneradmin\\AppD...ming', 'CI': 'true', 'COMSPEC': 'C:\\Windows\\system32\\cmd.exe', 'HOME': 'C:\\Users\\runneradmin', ...}, 'stdout': -1}
process = <Popen: returncode: 1 args: ['D:\\a\\pex\\pex\\repo\\.tox\\py313-pip25_0-int...>
stdout = b'', stderr = None, retcode = 1
def run(*popenargs,
input=None, capture_output=False, timeout=None, check=False, **kwargs):
"""Run command with arguments and return a CompletedProcess instance.
The returned instance will have attributes args, returncode, stdout and
stderr. By default, stdout and stderr are not captured, and those attributes
will be None. Pass stdout=PIPE and/or stderr=PIPE in order to capture them,
or pass capture_output=True to capture both.
If check is True and the exit code was non-zero, it raises a
CalledProcessError. The CalledProcessError object will have the return code
in the returncode attribute, and output & stderr attributes if those streams
were captured.
If timeout (seconds) is given and the process takes too long,
a TimeoutExpired exception will be raised.
There is an optional argument "input", allowing you to
pass bytes or a string to the subprocess's stdin. If you use this argument
you may not also use the Popen constructor's "stdin" argument, as
it will be used internally.
By default, all communication is in bytes, and therefore any "input" should
be bytes, and the stdout and stderr will be bytes. If in text mode, any
"input" should be a string, and stdout and stderr will be strings decoded
according to locale encoding, or by "encoding" if set. Text mode is
triggered by setting any of text, encoding, errors or universal_newlines.
The other arguments are the same as for the Popen constructor.
"""
if input is not None:
if kwargs.get('stdin') is not None:
raise ValueError('stdin and input arguments may not both be used.')
kwargs['stdin'] = PIPE
if capture_output:
if kwargs.get('stdout') is not None or kwargs.get('stderr') is not None:
raise ValueError('stdout and stderr arguments may not be used '
'with capture_output.')
kwargs['stdout'] = PIPE
kwargs['stderr'] = PIPE
with Popen(*popenargs, **kwargs) as process:
try:
stdout, stderr = process.communicate(input, timeout=timeout)
except TimeoutExpired as exc:
process.kill()
if _mswindows:
# Windows accumulates the output in a single blocking
# read() call run on child threads, with the timeout
# being done in a join() on those threads. communicate()
# _after_ kill() is required to collect that and add it
# to the exception.
exc.stdout, exc.stderr = process.communicate()
else:
# POSIX _communicate already populated the output so
# far into the TimeoutExpired exception.
process.wait()
raise
except: # Including KeyboardInterrupt, communicate handled that.
process.kill()
# We don't call process.wait() as .__exit__ does that for us.
raise
retcode = process.poll()
if check and retcode:
> raise CalledProcessError(retcode, process.args,
output=stdout, stderr=stderr)
E subprocess.CalledProcessError: Command '['D:\\a\\pex\\pex\\repo\\.tox\\py313-pip25_0-integration\\Scripts\\python.EXE', 'C:\\Users\\runneradmin\\AppData\\Local\\Temp\\pytest-of-runneradmin\\pytest-0\\popen-gw1\\test_empty_pex_no_args_T-d61790\\pex', '-c', 'from __future__ import print_function\n\nimport sys\n\n\nprint(sys.version, "on", sys.platform)\n']' returned non-zero exit status 1.
C:\hostedtoolcache\windows\Python\3.13.2\x64\Lib\subprocess.py:579: CalledProcessError
Check failure on line 0 in dist/test-results/integration-1.xml
github-actions / Windows Test Results
pytest ► tests.integration.test_issue_157 ► test_empty_pex_no_args[FORCE_COLOR-traditional-VENV]
Failed test found in:
dist/test-results/integration-1.xml
Error:
tmpdir = Tempdir(path='C:\\Users\\runneradmin\\AppData\\Local\\Temp\\pytest-of-runneradmin\\pytest-0\\popen-gw0\\test_empty_pex...ppData\\Local\\Temp\\pytest-of-runneradmin\\pytest-0\\popen-gw0\\test_empty_pex_no_args_FORCE_COLOR_traditional_VENV_')
Raw output
tmpdir = Tempdir(path='C:\\Users\\runneradmin\\AppData\\Local\\Temp\\pytest-of-runneradmin\\pytest-0\\popen-gw0\\test_empty_pex...ppData\\Local\\Temp\\pytest-of-runneradmin\\pytest-0\\popen-gw0\\test_empty_pex_no_args_FORCE_COLOR_traditional_VENV_')
pexpect_timeout = 10, execution_mode_args = ['--venv'], scie_args = []
color_config = ColorConfig(_env={'FORCE_COLOR': '1', 'TERM': 'dumb'}, _is_color=True)
@execution_mode_args
@pytest.mark.parametrize(
"scie_args",
[pytest.param([], id="traditional")]
+ ([pytest.param(["--scie", "eager"], id="scie")] if scie.has_provider() else []),
)
@pytest.mark.parametrize(
"color_config",
[
pytest.param(ColorConfig.create(is_color=True), id="IS_TTY"),
pytest.param(ColorConfig.create(is_color=False, NO_COLOR="1"), id="NO_COLOR"),
pytest.param(ColorConfig.create(is_color=False, TERM="dumb"), id="TERM=dumb"),
pytest.param(
ColorConfig.create(is_color=True, FORCE_COLOR="1", TERM="dumb"), id="FORCE_COLOR"
),
],
)
def test_empty_pex_no_args(
tmpdir, # type: Any
pexpect_timeout, # type: int
execution_mode_args, # type: List[str]
scie_args, # type: List[str]
color_config, # type:ColorConfig
):
# type: (...) -> None
> pex = create_pex(tmpdir, extra_args=execution_mode_args + scie_args)
tests\integration\test_issue_157.py:201:
_ _ _ _ _ _ _ _ _ _ _ _ _ _ _ _ _ _ _ _ _ _ _ _ _ _ _ _ _ _ _ _ _ _ _ _ _ _ _ _
tests\integration\test_issue_157.py:104: in create_pex
subprocess.check_output(
testing\subprocess.py:69: in check_output
return cast(bytes, subprocess.check_output(args=_safe_args(args), **kwargs))
C:\hostedtoolcache\windows\Python\3.13.2\x64\Lib\subprocess.py:474: in check_output
return run(*popenargs, stdout=PIPE, timeout=timeout, check=True,
_ _ _ _ _ _ _ _ _ _ _ _ _ _ _ _ _ _ _ _ _ _ _ _ _ _ _ _ _ _ _ _ _ _ _ _ _ _ _ _
input = None, capture_output = False, timeout = None, check = True
popenargs = ()
kwargs = {'args': ['D:\\a\\pex\\pex\\repo\\.tox\\py313-pip25_0-integration\\Scripts\\python.EXE', 'C:\\Users\\runneradmin\\AppD...ming', 'CI': 'true', 'COMSPEC': 'C:\\Windows\\system32\\cmd.exe', 'HOME': 'C:\\Users\\runneradmin', ...}, 'stdout': -1}
process = <Popen: returncode: 1 args: ['D:\\a\\pex\\pex\\repo\\.tox\\py313-pip25_0-int...>
stdout = b'', stderr = None, retcode = 1
def run(*popenargs,
input=None, capture_output=False, timeout=None, check=False, **kwargs):
"""Run command with arguments and return a CompletedProcess instance.
The returned instance will have attributes args, returncode, stdout and
stderr. By default, stdout and stderr are not captured, and those attributes
will be None. Pass stdout=PIPE and/or stderr=PIPE in order to capture them,
or pass capture_output=True to capture both.
If check is True and the exit code was non-zero, it raises a
CalledProcessError. The CalledProcessError object will have the return code
in the returncode attribute, and output & stderr attributes if those streams
were captured.
If timeout (seconds) is given and the process takes too long,
a TimeoutExpired exception will be raised.
There is an optional argument "input", allowing you to
pass bytes or a string to the subprocess's stdin. If you use this argument
you may not also use the Popen constructor's "stdin" argument, as
it will be used internally.
By default, all communication is in bytes, and therefore any "input" should
be bytes, and the stdout and stderr will be bytes. If in text mode, any
"input" should be a string, and stdout and stderr will be strings decoded
according to locale encoding, or by "encoding" if set. Text mode is
triggered by setting any of text, encoding, errors or universal_newlines.
The other arguments are the same as for the Popen constructor.
"""
if input is not None:
if kwargs.get('stdin') is not None:
raise ValueError('stdin and input arguments may not both be used.')
kwargs['stdin'] = PIPE
if capture_output:
if kwargs.get('stdout') is not None or kwargs.get('stderr') is not None:
raise ValueError('stdout and stderr arguments may not be used '
'with capture_output.')
kwargs['stdout'] = PIPE
kwargs['stderr'] = PIPE
with Popen(*popenargs, **kwargs) as process:
try:
stdout, stderr = process.communicate(input, timeout=timeout)
except TimeoutExpired as exc:
process.kill()
if _mswindows:
# Windows accumulates the output in a single blocking
# read() call run on child threads, with the timeout
# being done in a join() on those threads. communicate()
# _after_ kill() is required to collect that and add it
# to the exception.
exc.stdout, exc.stderr = process.communicate()
else:
# POSIX _communicate already populated the output so
# far into the TimeoutExpired exception.
process.wait()
raise
except: # Including KeyboardInterrupt, communicate handled that.
process.kill()
# We don't call process.wait() as .__exit__ does that for us.
raise
retcode = process.poll()
if check and retcode:
> raise CalledProcessError(retcode, process.args,
output=stdout, stderr=stderr)
E subprocess.CalledProcessError: Command '['D:\\a\\pex\\pex\\repo\\.tox\\py313-pip25_0-integration\\Scripts\\python.EXE', 'C:\\Users\\runneradmin\\AppData\\Local\\Temp\\pytest-of-runneradmin\\pytest-0\\popen-gw0\\test_empty_pex_no_args_F-863f50\\pex', '-c', 'from __future__ import print_function\n\nimport sys\n\n\nprint(sys.version, "on", sys.platform)\n']' returned non-zero exit status 1.
C:\hostedtoolcache\windows\Python\3.13.2\x64\Lib\subprocess.py:579: CalledProcessError
Check failure on line 0 in dist/test-results/integration-1.xml
github-actions / Windows Test Results
pytest ► tests.integration.test_issue_1598 ► test_mount_respects_env
Failed test found in:
dist/test-results/integration-1.xml
Error:
pex_project_dir = 'D:/a/pex/pex/repo'
Raw output
pex_project_dir = 'D:/a/pex/pex/repo'
tmpdir = Tempdir(path='C:\\Users\\runneradmin\\AppData\\Local\\Temp\\pytest-of-runneradmin\\pytest-0\\popen-gw0\\test_mount_respects_env0', symlink=None)
def test_mount_respects_env(
pex_project_dir, # type: str
tmpdir, # type: Any
):
# type: (...) -> None
home = os.path.join(str(tmpdir), "home")
rel_pex_root = os.path.relpath(cache_root.path(expand_user=False), "~")
pex_root = os.path.join(home, rel_pex_root)
os.makedirs(pex_root)
os.chmod(pex_root, 0o555)
unwritable_pex_root_warning = "PEXWarning: PEX_ROOT is configured as {}".format(pex_root)
pex_file = os.path.join(str(tmpdir), "pex.pex")
result = run_pex_command(
args=[pex_project_dir, "-o", pex_file], env=make_env(HOME=home), quiet=True
)
> result.assert_success()
tests\integration\test_issue_1598.py:33:
_ _ _ _ _ _ _ _ _ _ _ _ _ _ _ _ _ _ _ _ _ _ _ _ _ _ _ _ _ _ _ _ _ _ _ _ _ _ _ _
self = IntegResults(output='', error="Failed to spawn a job for D:\\a\\pex\\pex\\repo\\.tox\\py313-pip25_0-integration\\Scrip...a\\\\Local\\\\Temp\\\\tmp0ft91ft1\\\\wheels', 'pip==25.0', 'setuptools==75.3.0', 'wheel==0.45.1']`\r\n", return_code=1)
expected_output_re = None, expected_error_re = None, re_flags = 0
def assert_success(
self,
expected_output_re=None, # type: Optional[str]
expected_error_re=None, # type: Optional[str]
re_flags=0, # type: int
):
# type: (...) -> None
assert (
> self.return_code == 0
), "integration test failed: return_code={}, output={}, error={}".format(
self.return_code, self.output, self.error
)
E AssertionError: integration test failed: return_code=1, output=, error=Failed to spawn a job for D:\a\pex\pex\repo\.tox\py313-pip25_0-integration\Scripts\python.exe: Failed to bootstrap Pip 25.0.
E Failed to download its dependencies: received exit code 1 during execution of `['C:\\Users\\runneradmin\\AppData\\Local\\Temp\\tmp0ft91ft1\\pip\\Scripts\\python.exe', '-s', '-E', '-m', 'pip', 'wheel', '--wheel-dir', 'C:\\Users\\runneradmin\\AppData\\Local\\Temp\\tmp0ft91ft1\\wheels', 'pip==25.0', 'setuptools==75.3.0', 'wheel==0.45.1']` while trying to execute `['C:\\Users\\runneradmin\\AppData\\Local\\Temp\\tmp0ft91ft1\\pip\\Scripts\\python.exe', '-s', '-E', '-m', 'pip', 'wheel', '--wheel-dir', 'C:\\Users\\runneradmin\\AppData\\Local\\Temp\\tmp0ft91ft1\\wheels', 'pip==25.0', 'setuptools==75.3.0', 'wheel==0.45.1']`
testing\__init__.py:407: AssertionError